mbox series

[v4,0/4] Implement "non 100% native mode" in via-ide

Message ID cover.1583867210.git.balaton@eik.bme.hu
Headers show
Series Implement "non 100% native mode" in via-ide | expand

Message

BALATON Zoltan March 10, 2020, 7:06 p.m. UTC
This (started to be small but getting bigger) series implements
"non-100% native mode" of via-ide found at least on pegasos2 where io
addresses come from PCI BARs but interrupts are hard coded to legacy
IRQ14 and 15. This is needed for guests that expect it and activate
work arounds on that platform and don't work unless this is emulated.
(Symptom is missing IDE IRQs after enabling BMDMA and boot freezes
waiting for interrupt.)

We need a flag to turn this mode on or off so we repurpose the last
remaining CMD646 specific field in PCIIDEState to allow more flags and
make room for the new legacy-irq flag there. (The CMD646 may need
similar mode or something else may need more flags in the future.)
Boards using CMD646 and VIA IDE are updated for the above changes.
Also included a patch fixing up PCI reset to not clear value set by
device emulation on bus reset when wmask does not allow that and
another getting rid of via_ide_init helper that's now out of fashion.

Tested with Linux and MorphOS on pegasos2 and a Gentoo live CD kernel
for mips_fulong2e that's the only one I could find but being beta not
sure if that fully works on real hardware. (The mips_fulong2e also
seems to have problems with pci devices so to boot Linux you need
-net none -vga none and use serial console otherwise the kernel panics.)

v4 is rebased on top of Mark's cmd646 patches that are now on the ide
tree.

Regards,
BALATON Zoltan

BALATON Zoltan (4):
  ide/via: Get rid of via_init_ide()
  ide: Make room for flags in PCIIDEState and add one for legacy IRQ
    routing
  pci: Honour wmask when resetting PCI_INTERRUPT_LINE
  via-ide: Also emulate non 100% native mode

 hw/ide/cmd646.c         |  4 ++--
 hw/ide/via.c            | 36 +++++++++++++++++++++++-------------
 hw/mips/mips_fulong2e.c |  5 ++++-
 hw/pci/pci.c            |  5 ++++-
 hw/sparc64/sun4u.c      |  2 +-
 include/hw/ide.h        |  1 -
 include/hw/ide/pci.h    |  7 ++++++-
 7 files changed, 40 insertions(+), 20 deletions(-)

Comments

no-reply@patchew.org March 10, 2020, 10:39 p.m. UTC | #1
Patchew URL: https://patchew.org/QEMU/cover.1583867210.git.balaton@eik.bme.hu/



Hi,

This series failed the asan build test. Please find the testing commands and
their output below. If you have Docker installed, you can probably reproduce it
locally.

=== TEST SCRIPT BEGIN ===
#!/bin/bash
export ARCH=x86_64
make docker-image-fedora V=1 NETWORK=1
time make docker-test-debug@fedora TARGET_LIST=x86_64-softmmu J=14 NETWORK=1
=== TEST SCRIPT END ===

PASS 1 fdc-test /x86_64/fdc/cmos
PASS 2 fdc-test /x86_64/fdc/no_media_on_start
PASS 3 fdc-test /x86_64/fdc/read_without_media
==6176==WARNING: ASan doesn't fully support makecontext/swapcontext functions and may produce false positives in some cases!
PASS 4 fdc-test /x86_64/fdc/media_change
PASS 5 fdc-test /x86_64/fdc/sense_interrupt
PASS 6 fdc-test /x86_64/fdc/relative_seek
---
PASS 32 test-opts-visitor /visitor/opts/range/beyond
PASS 33 test-opts-visitor /visitor/opts/dict/unvisited
MALLOC_PERTURB_=${MALLOC_PERTURB_:-$(( ${RANDOM:-0} % 255 + 1))}  tests/test-coroutine -m=quick -k --tap < /dev/null | ./scripts/tap-driver.pl --test-name="test-coroutine" 
==6227==WARNING: ASan doesn't fully support makecontext/swapcontext functions and may produce false positives in some cases!
==6227==WARNING: ASan is ignoring requested __asan_handle_no_return: stack top: 0x7fff30fcf000; bottom 0x7f3722720000; size: 0x00c80e8af000 (859237445632)
False positive error reports may follow
For details see https://github.com/google/sanitizers/issues/189
PASS 1 test-coroutine /basic/no-dangling-access
---
PASS 12 test-aio /aio/event/flush
PASS 13 test-aio /aio/event/wait/no-flush-cb
PASS 14 test-aio /aio/timer/schedule
==6242==WARNING: ASan doesn't fully support makecontext/swapcontext functions and may produce false positives in some cases!
PASS 15 test-aio /aio/coroutine/queue-chaining
PASS 16 test-aio /aio-gsource/flush
PASS 17 test-aio /aio-gsource/bh/schedule
---
PASS 28 test-aio /aio-gsource/timer/schedule
MALLOC_PERTURB_=${MALLOC_PERTURB_:-$(( ${RANDOM:-0} % 255 + 1))}  tests/test-aio-multithread -m=quick -k --tap < /dev/null | ./scripts/tap-driver.pl --test-name="test-aio-multithread" 
PASS 12 fdc-test /x86_64/fdc/read_no_dma_19
==6247==WARNING: ASan doesn't fully support makecontext/swapcontext functions and may produce false positives in some cases!
PASS 1 test-aio-multithread /aio/multi/lifecycle
PASS 13 fdc-test /x86_64/fdc/fuzz-registers
MALLOC_PERTURB_=${MALLOC_PERTURB_:-$(( ${RANDOM:-0} % 255 + 1))}  QTEST_QEMU_BINARY=x86_64-softmmu/qemu-system-x86_64 QTEST_QEMU_IMG=qemu-img tests/qtest/ide-test -m=quick -k --tap < /dev/null | ./scripts/tap-driver.pl --test-name="ide-test" 
==6264==WARNING: ASan doesn't fully support makecontext/swapcontext functions and may produce false positives in some cases!
PASS 2 test-aio-multithread /aio/multi/schedule
PASS 1 ide-test /x86_64/ide/identify
==6275==WARNING: ASan doesn't fully support makecontext/swapcontext functions and may produce false positives in some cases!
PASS 2 ide-test /x86_64/ide/flush
PASS 3 test-aio-multithread /aio/multi/mutex/contended
==6281==WARNING: ASan doesn't fully support makecontext/swapcontext functions and may produce false positives in some cases!
PASS 3 ide-test /x86_64/ide/bmdma/simple_rw
==6292==WARNING: ASan doesn't fully support makecontext/swapcontext functions and may produce false positives in some cases!
PASS 4 ide-test /x86_64/ide/bmdma/trim
==6298==WARNING: ASan doesn't fully support makecontext/swapcontext functions and may produce false positives in some cases!
PASS 4 test-aio-multithread /aio/multi/mutex/handoff
PASS 5 test-aio-multithread /aio/multi/mutex/mcs
PASS 6 test-aio-multithread /aio/multi/mutex/pthread
MALLOC_PERTURB_=${MALLOC_PERTURB_:-$(( ${RANDOM:-0} % 255 + 1))}  tests/test-throttle -m=quick -k --tap < /dev/null | ./scripts/tap-driver.pl --test-name="test-throttle" 
==6315==WARNING: ASan doesn't fully support makecontext/swapcontext functions and may produce false positives in some cases!
PASS 1 test-throttle /throttle/leak_bucket
PASS 2 test-throttle /throttle/compute_wait
PASS 3 test-throttle /throttle/init
---
PASS 14 test-throttle /throttle/config/max
PASS 15 test-throttle /throttle/config/iops_size
MALLOC_PERTURB_=${MALLOC_PERTURB_:-$(( ${RANDOM:-0} % 255 + 1))}  tests/test-thread-pool -m=quick -k --tap < /dev/null | ./scripts/tap-driver.pl --test-name="test-thread-pool" 
==6319==WARNING: ASan doesn't fully support makecontext/swapcontext functions and may produce false positives in some cases!
PASS 1 test-thread-pool /thread-pool/submit
PASS 2 test-thread-pool /thread-pool/submit-aio
PASS 3 test-thread-pool /thread-pool/submit-co
PASS 4 test-thread-pool /thread-pool/submit-many
PASS 5 test-thread-pool /thread-pool/cancel
==6386==WARNING: ASan doesn't fully support makecontext/swapcontext functions and may produce false positives in some cases!
PASS 6 test-thread-pool /thread-pool/cancel-async
MALLOC_PERTURB_=${MALLOC_PERTURB_:-$(( ${RANDOM:-0} % 255 + 1))}  tests/test-hbitmap -m=quick -k --tap < /dev/null | ./scripts/tap-driver.pl --test-name="test-hbitmap" 
PASS 1 test-hbitmap /hbitmap/granularity
---
PASS 28 test-hbitmap /hbitmap/truncate/shrink/medium
PASS 29 test-hbitmap /hbitmap/truncate/shrink/large
PASS 30 test-hbitmap /hbitmap/meta/zero
==6396==WARNING: ASan doesn't fully support makecontext/swapcontext functions and may produce false positives in some cases!
PASS 31 test-hbitmap /hbitmap/meta/one
PASS 32 test-hbitmap /hbitmap/meta/byte
PASS 33 test-hbitmap /hbitmap/meta/word
PASS 34 test-hbitmap /hbitmap/meta/sector
PASS 35 test-hbitmap /hbitmap/serialize/align
==6402==WARNING: ASan doesn't fully support makecontext/swapcontext functions and may produce false positives in some cases!
PASS 36 test-hbitmap /hbitmap/serialize/basic
PASS 37 test-hbitmap /hbitmap/serialize/part
PASS 38 test-hbitmap /hbitmap/serialize/zeroes
---
PASS 44 test-hbitmap /hbitmap/next_dirty_area/next_dirty_area_4
PASS 45 test-hbitmap /hbitmap/next_dirty_area/next_dirty_area_after_truncate
MALLOC_PERTURB_=${MALLOC_PERTURB_:-$(( ${RANDOM:-0} % 255 + 1))}  tests/test-bdrv-drain -m=quick -k --tap < /dev/null | ./scripts/tap-driver.pl --test-name="test-bdrv-drain" 
==6409==WARNING: ASan doesn't fully support makecontext/swapcontext functions and may produce false positives in some cases!
PASS 1 test-bdrv-drain /bdrv-drain/nested
PASS 2 test-bdrv-drain /bdrv-drain/multiparent
PASS 3 test-bdrv-drain /bdrv-drain/set_aio_context
---
PASS 41 test-bdrv-drain /bdrv-drain/bdrv_drop_intermediate/poll
PASS 42 test-bdrv-drain /bdrv-drain/replace_child/mid-drain
MALLOC_PERTURB_=${MALLOC_PERTURB_:-$(( ${RANDOM:-0} % 255 + 1))}  tests/test-bdrv-graph-mod -m=quick -k --tap < /dev/null | ./scripts/tap-driver.pl --test-name="test-bdrv-graph-mod" 
==6448==WARNING: ASan doesn't fully support makecontext/swapcontext functions and may produce false positives in some cases!
PASS 1 test-bdrv-graph-mod /bdrv-graph-mod/update-perm-tree
PASS 2 test-bdrv-graph-mod /bdrv-graph-mod/should-update-child
MALLOC_PERTURB_=${MALLOC_PERTURB_:-$(( ${RANDOM:-0} % 255 + 1))}  tests/test-blockjob -m=quick -k --tap < /dev/null | ./scripts/tap-driver.pl --test-name="test-blockjob" 
==6452==WARNING: ASan doesn't fully support makecontext/swapcontext functions and may produce false positives in some cases!
PASS 1 test-blockjob /blockjob/ids
PASS 2 test-blockjob /blockjob/cancel/created
PASS 3 test-blockjob /blockjob/cancel/running
---
PASS 7 test-blockjob /blockjob/cancel/pending
PASS 8 test-blockjob /blockjob/cancel/concluded
MALLOC_PERTURB_=${MALLOC_PERTURB_:-$(( ${RANDOM:-0} % 255 + 1))}  tests/test-blockjob-txn -m=quick -k --tap < /dev/null | ./scripts/tap-driver.pl --test-name="test-blockjob-txn" 
==6456==WARNING: ASan doesn't fully support makecontext/swapcontext functions and may produce false positives in some cases!
PASS 1 test-blockjob-txn /single/success
PASS 2 test-blockjob-txn /single/failure
PASS 3 test-blockjob-txn /single/cancel
---
PASS 6 test-blockjob-txn /pair/cancel
PASS 7 test-blockjob-txn /pair/fail-cancel-race
MALLOC_PERTURB_=${MALLOC_PERTURB_:-$(( ${RANDOM:-0} % 255 + 1))}  tests/test-block-backend -m=quick -k --tap < /dev/null | ./scripts/tap-driver.pl --test-name="test-block-backend" 
==6460==WARNING: ASan doesn't fully support makecontext/swapcontext functions and may produce false positives in some cases!
PASS 1 test-block-backend /block-backend/drain_aio_error
PASS 2 test-block-backend /block-backend/drain_all_aio_error
MALLOC_PERTURB_=${MALLOC_PERTURB_:-$(( ${RANDOM:-0} % 255 + 1))}  tests/test-block-iothread -m=quick -k --tap < /dev/null | ./scripts/tap-driver.pl --test-name="test-block-iothread" 
==6464==WARNING: ASan doesn't fully support makecontext/swapcontext functions and may produce false positives in some cases!
PASS 1 test-block-iothread /sync-op/pread
PASS 2 test-block-iothread /sync-op/pwrite
PASS 3 test-block-iothread /sync-op/load_vmstate
---
PASS 15 test-block-iothread /propagate/diamond
PASS 16 test-block-iothread /propagate/mirror
MALLOC_PERTURB_=${MALLOC_PERTURB_:-$(( ${RANDOM:-0} % 255 + 1))}  tests/test-image-locking -m=quick -k --tap < /dev/null | ./scripts/tap-driver.pl --test-name="test-image-locking" 
==6484==WARNING: ASan doesn't fully support makecontext/swapcontext functions and may produce false positives in some cases!
PASS 1 test-image-locking /image-locking/basic
PASS 2 test-image-locking /image-locking/set-perm-abort
MALLOC_PERTURB_=${MALLOC_PERTURB_:-$(( ${RANDOM:-0} % 255 + 1))}  tests/test-x86-cpuid -m=quick -k --tap < /dev/null | ./scripts/tap-driver.pl --test-name="test-x86-cpuid" 
---
PASS 1 test-shift128 /host-utils/test_lshift
PASS 2 test-shift128 /host-utils/test_rshift
MALLOC_PERTURB_=${MALLOC_PERTURB_:-$(( ${RANDOM:-0} % 255 + 1))}  tests/test-mul64 -m=quick -k --tap < /dev/null | ./scripts/tap-driver.pl --test-name="test-mul64" 
==6498==WARNING: ASan doesn't fully support makecontext/swapcontext functions and may produce false positives in some cases!
PASS 1 test-mul64 /host-utils/mulu64
PASS 2 test-mul64 /host-utils/muls64
MALLOC_PERTURB_=${MALLOC_PERTURB_:-$(( ${RANDOM:-0} % 255 + 1))}  tests/test-int128 -m=quick -k --tap < /dev/null | ./scripts/tap-driver.pl --test-name="test-int128" 
---
MALLOC_PERTURB_=${MALLOC_PERTURB_:-$(( ${RANDOM:-0} % 255 + 1))}  tests/test-rcu-list -m=quick -k --tap < /dev/null | ./scripts/tap-driver.pl --test-name="test-rcu-list" 
PASS 1 test-rcu-list /rcu/qlist/single-threaded
PASS 2 test-rcu-list /rcu/qlist/short-few
==6575==WARNING: ASan doesn't fully support makecontext/swapcontext functions and may produce false positives in some cases!
PASS 3 test-rcu-list /rcu/qlist/long-many
MALLOC_PERTURB_=${MALLOC_PERTURB_:-$(( ${RANDOM:-0} % 255 + 1))}  tests/test-rcu-simpleq -m=quick -k --tap < /dev/null | ./scripts/tap-driver.pl --test-name="test-rcu-simpleq" 
PASS 1 test-rcu-simpleq /rcu/qsimpleq/single-threaded
---
PASS 3 test-rcu-simpleq /rcu/qsimpleq/long-many
MALLOC_PERTURB_=${MALLOC_PERTURB_:-$(( ${RANDOM:-0} % 255 + 1))}  tests/test-rcu-tailq -m=quick -k --tap < /dev/null | ./scripts/tap-driver.pl --test-name="test-rcu-tailq" 
PASS 1 test-rcu-tailq /rcu/qtailq/single-threaded
==6620==WARNING: ASan doesn't fully support makecontext/swapcontext functions and may produce false positives in some cases!
PASS 2 test-rcu-tailq /rcu/qtailq/short-few
PASS 3 test-rcu-tailq /rcu/qtailq/long-many
MALLOC_PERTURB_=${MALLOC_PERTURB_:-$(( ${RANDOM:-0} % 255 + 1))}  tests/test-rcu-slist -m=quick -k --tap < /dev/null | ./scripts/tap-driver.pl --test-name="test-rcu-slist" 
PASS 1 test-rcu-slist /rcu/qslist/single-threaded
PASS 2 test-rcu-slist /rcu/qslist/short-few
==6686==WARNING: ASan doesn't fully support makecontext/swapcontext functions and may produce false positives in some cases!
PASS 3 test-rcu-slist /rcu/qslist/long-many
MALLOC_PERTURB_=${MALLOC_PERTURB_:-$(( ${RANDOM:-0} % 255 + 1))}  tests/test-qdist -m=quick -k --tap < /dev/null | ./scripts/tap-driver.pl --test-name="test-qdist" 
PASS 1 test-qdist /qdist/none
---
PASS 7 test-qdist /qdist/binning/expand
PASS 8 test-qdist /qdist/binning/shrink
MALLOC_PERTURB_=${MALLOC_PERTURB_:-$(( ${RANDOM:-0} % 255 + 1))}  tests/test-qht -m=quick -k --tap < /dev/null | ./scripts/tap-driver.pl --test-name="test-qht" 
==6699==WARNING: ASan doesn't fully support makecontext/swapcontext functions and may produce false positives in some cases!
PASS 5 ide-test /x86_64/ide/bmdma/various_prdts
==6705==WARNING: ASan doesn't fully support makecontext/swapcontext functions and may produce false positives in some cases!
==6705==WARNING: ASan is ignoring requested __asan_handle_no_return: stack top: 0x7ffc4ca71000; bottom 0x7f3f09566000; size: 0x00bd4350b000 (812878180352)
False positive error reports may follow
For details see https://github.com/google/sanitizers/issues/189
PASS 6 ide-test /x86_64/ide/bmdma/no_busmaster
PASS 7 ide-test /x86_64/ide/flush/nodev
==6716==WARNING: ASan doesn't fully support makecontext/swapcontext functions and may produce false positives in some cases!
PASS 8 ide-test /x86_64/ide/flush/empty_drive
PASS 1 test-qht /qht/mode/default
PASS 2 test-qht /qht/mode/resize
MALLOC_PERTURB_=${MALLOC_PERTURB_:-$(( ${RANDOM:-0} % 255 + 1))}  tests/test-qht-par -m=quick -k --tap < /dev/null | ./scripts/tap-driver.pl --test-name="test-qht-par" 
==6721==WARNING: ASan doesn't fully support makecontext/swapcontext functions and may produce false positives in some cases!
PASS 9 ide-test /x86_64/ide/flush/retry_pci
PASS 1 test-qht-par /qht/parallel/2threads-0%updates-1s
==6736==WARNING: ASan doesn't fully support makecontext/swapcontext functions and may produce false positives in some cases!
PASS 10 ide-test /x86_64/ide/flush/retry_isa
PASS 2 test-qht-par /qht/parallel/2threads-20%updates-1s
MALLOC_PERTURB_=${MALLOC_PERTURB_:-$(( ${RANDOM:-0} % 255 + 1))}  tests/test-bitops -m=quick -k --tap < /dev/null | ./scripts/tap-driver.pl --test-name="test-bitops" 
==6748==WARNING: ASan doesn't fully support makecontext/swapcontext functions and may produce false positives in some cases!
PASS 11 ide-test /x86_64/ide/cdrom/pio
PASS 1 test-bitops /bitops/sextract32
PASS 2 test-bitops /bitops/sextract64
---
PASS 3 test-qdev-global-props /qdev/properties/dynamic/global
PASS 4 test-qdev-global-props /qdev/properties/global/subclass
MALLOC_PERTURB_=${MALLOC_PERTURB_:-$(( ${RANDOM:-0} % 255 + 1))}  tests/check-qom-interface -m=quick -k --tap < /dev/null | ./scripts/tap-driver.pl --test-name="check-qom-interface" 
==6757==WARNING: ASan doesn't fully support makecontext/swapcontext functions and may produce false positives in some cases!
PASS 1 check-qom-interface /qom/interface/direct_impl
PASS 2 check-qom-interface /qom/interface/intermediate_impl
MALLOC_PERTURB_=${MALLOC_PERTURB_:-$(( ${RANDOM:-0} % 255 + 1))}  tests/check-qom-proplist -m=quick -k --tap < /dev/null | ./scripts/tap-driver.pl --test-name="check-qom-proplist" 
---
PASS 6 test-crypto-secret /crypto/secret/noconv/base64/good
PASS 7 test-crypto-secret /crypto/secret/noconv/base64/bad
PASS 8 test-crypto-secret /crypto/secret/conv/base64/utf8valid
==6799==WARNING: ASan doesn't fully support makecontext/swapcontext functions and may produce false positives in some cases!
PASS 9 test-crypto-secret /crypto/secret/conv/base64/utf8invalid
PASS 10 test-crypto-secret /crypto/secret/conv/utf8/base64
PASS 11 test-crypto-secret /crypto/secret/crypt/raw
---
MALLOC_PERTURB_=${MALLOC_PERTURB_:-$(( ${RANDOM:-0} % 255 + 1))}  QTEST_QEMU_BINARY=x86_64-softmmu/qemu-system-x86_64 QTEST_QEMU_IMG=qemu-img tests/qtest/ahci-test -m=quick -k --tap < /dev/null | ./scripts/tap-driver.pl --test-name="ahci-test" 
PASS 1 test-crypto-tlscredsx509 /qcrypto/tlscredsx509/perfectserver
PASS 2 test-crypto-tlscredsx509 /qcrypto/tlscredsx509/perfectclient
==6834==WARNING: ASan doesn't fully support makecontext/swapcontext functions and may produce false positives in some cases!
PASS 1 ahci-test /x86_64/ahci/sanity
PASS 3 test-crypto-tlscredsx509 /qcrypto/tlscredsx509/goodca1
PASS 4 test-crypto-tlscredsx509 /qcrypto/tlscredsx509/goodca2
==6840==WARNING: ASan doesn't fully support makecontext/swapcontext functions and may produce false positives in some cases!
PASS 2 ahci-test /x86_64/ahci/pci_spec
PASS 5 test-crypto-tlscredsx509 /qcrypto/tlscredsx509/goodca3
PASS 6 test-crypto-tlscredsx509 /qcrypto/tlscredsx509/badca1
PASS 7 test-crypto-tlscredsx509 /qcrypto/tlscredsx509/badca2
PASS 8 test-crypto-tlscredsx509 /qcrypto/tlscredsx509/badca3
==6846==WARNING: ASan doesn't fully support makecontext/swapcontext functions and may produce false positives in some cases!
PASS 9 test-crypto-tlscredsx509 /qcrypto/tlscredsx509/goodserver1
PASS 3 ahci-test /x86_64/ahci/pci_enable
==6852==WARNING: ASan doesn't fully support makecontext/swapcontext functions and may produce false positives in some cases!
PASS 10 test-crypto-tlscredsx509 /qcrypto/tlscredsx509/goodserver2
PASS 4 ahci-test /x86_64/ahci/hba_spec
PASS 11 test-crypto-tlscredsx509 /qcrypto/tlscredsx509/goodserver3
==6858==WARNING: ASan doesn't fully support makecontext/swapcontext functions and may produce false positives in some cases!
PASS 5 ahci-test /x86_64/ahci/hba_enable
PASS 12 test-crypto-tlscredsx509 /qcrypto/tlscredsx509/goodserver4
PASS 13 test-crypto-tlscredsx509 /qcrypto/tlscredsx509/goodserver5
==6864==WARNING: ASan doesn't fully support makecontext/swapcontext functions and may produce false positives in some cases!
PASS 6 ahci-test /x86_64/ahci/identify
==6870==WARNING: ASan doesn't fully support makecontext/swapcontext functions and may produce false positives in some cases!
PASS 7 ahci-test /x86_64/ahci/max
==6876==WARNING: ASan doesn't fully support makecontext/swapcontext functions and may produce false positives in some cases!
PASS 14 test-crypto-tlscredsx509 /qcrypto/tlscredsx509/goodserver6
PASS 8 ahci-test /x86_64/ahci/reset
PASS 15 test-crypto-tlscredsx509 /qcrypto/tlscredsx509/goodserver7
---
PASS 32 test-crypto-tlscredsx509 /qcrypto/tlscredsx509/inactive1
PASS 33 test-crypto-tlscredsx509 /qcrypto/tlscredsx509/inactive2
PASS 34 test-crypto-tlscredsx509 /qcrypto/tlscredsx509/inactive3
==6882==WARNING: ASan doesn't fully support makecontext/swapcontext functions and may produce false positives in some cases!
==6882==WARNING: ASan is ignoring requested __asan_handle_no_return: stack top: 0x7ffd3d0dc000; bottom 0x7f28c89fe000; size: 0x00d4746de000 (912486424576)
False positive error reports may follow
For details see https://github.com/google/sanitizers/issues/189
PASS 9 ahci-test /x86_64/ahci/io/pio/lba28/simple/zero
---
PASS 38 test-crypto-tlscredsx509 /qcrypto/tlscredsx509/missingserver
PASS 39 test-crypto-tlscredsx509 /qcrypto/tlscredsx509/missingclient
MALLOC_PERTURB_=${MALLOC_PERTURB_:-$(( ${RANDOM:-0} % 255 + 1))}  tests/test-crypto-tlssession -m=quick -k --tap < /dev/null | ./scripts/tap-driver.pl --test-name="test-crypto-tlssession" 
==6888==WARNING: ASan doesn't fully support makecontext/swapcontext functions and may produce false positives in some cases!
==6888==WARNING: ASan is ignoring requested __asan_handle_no_return: stack top: 0x7ffffd18b000; bottom 0x7f113f9fe000; size: 0x00eebd78d000 (1025381027840)
False positive error reports may follow
For details see https://github.com/google/sanitizers/issues/189
PASS 10 ahci-test /x86_64/ahci/io/pio/lba28/simple/low
==6898==WARNING: ASan doesn't fully support makecontext/swapcontext functions and may produce false positives in some cases!
PASS 1 test-crypto-tlssession /qcrypto/tlssession/psk
PASS 2 test-crypto-tlssession /qcrypto/tlssession/basicca
==6898==WARNING: ASan is ignoring requested __asan_handle_no_return: stack top: 0x7fff3b14c000; bottom 0x7f169a1fe000; size: 0x00e8a0f4e000 (999132815360)
False positive error reports may follow
For details see https://github.com/google/sanitizers/issues/189
PASS 11 ahci-test /x86_64/ahci/io/pio/lba28/simple/high
PASS 3 test-crypto-tlssession /qcrypto/tlssession/differentca
==6904==WARNING: ASan doesn't fully support makecontext/swapcontext functions and may produce false positives in some cases!
==6904==WARNING: ASan is ignoring requested __asan_handle_no_return: stack top: 0x7fff257f4000; bottom 0x7fb622ffe000; size: 0x0049027f6000 (313574514688)
False positive error reports may follow
For details see https://github.com/google/sanitizers/issues/189
PASS 4 test-crypto-tlssession /qcrypto/tlssession/altname1
PASS 12 ahci-test /x86_64/ahci/io/pio/lba28/double/zero
PASS 5 test-crypto-tlssession /qcrypto/tlssession/altname2
==6910==WARNING: ASan doesn't fully support makecontext/swapcontext functions and may produce false positives in some cases!
==6910==WARNING: ASan is ignoring requested __asan_handle_no_return: stack top: 0x7ffe74dde000; bottom 0x7f991c3fe000; size: 0x0065589e0000 (435278446592)
False positive error reports may follow
For details see https://github.com/google/sanitizers/issues/189
PASS 6 test-crypto-tlssession /qcrypto/tlssession/altname3
PASS 13 ahci-test /x86_64/ahci/io/pio/lba28/double/low
PASS 7 test-crypto-tlssession /qcrypto/tlssession/altname4
PASS 8 test-crypto-tlssession /qcrypto/tlssession/altname5
==6916==WARNING: ASan doesn't fully support makecontext/swapcontext functions and may produce false positives in some cases!
PASS 9 test-crypto-tlssession /qcrypto/tlssession/altname6
==6916==WARNING: ASan is ignoring requested __asan_handle_no_return: stack top: 0x7ffd07f6a000; bottom 0x7ff044dfe000; size: 0x000cc316c000 (54812655616)
False positive error reports may follow
For details see https://github.com/google/sanitizers/issues/189
PASS 14 ahci-test /x86_64/ahci/io/pio/lba28/double/high
PASS 10 test-crypto-tlssession /qcrypto/tlssession/wildcard1
PASS 11 test-crypto-tlssession /qcrypto/tlssession/wildcard2
==6922==WARNING: ASan doesn't fully support makecontext/swapcontext functions and may produce false positives in some cases!
==6922==WARNING: ASan is ignoring requested __asan_handle_no_return: stack top: 0x7ffe5cb52000; bottom 0x7fa053b24000; size: 0x005e0902e000 (403878109184)
False positive error reports may follow
For details see https://github.com/google/sanitizers/issues/189
PASS 15 ahci-test /x86_64/ahci/io/pio/lba28/long/zero
PASS 12 test-crypto-tlssession /qcrypto/tlssession/wildcard3
==6928==WARNING: ASan doesn't fully support makecontext/swapcontext functions and may produce false positives in some cases!
==6928==WARNING: ASan is ignoring requested __asan_handle_no_return: stack top: 0x7ffc0126c000; bottom 0x7fa68e324000; size: 0x005572f48000 (367000846336)
False positive error reports may follow
For details see https://github.com/google/sanitizers/issues/189
PASS 13 test-crypto-tlssession /qcrypto/tlssession/wildcard4
PASS 16 ahci-test /x86_64/ahci/io/pio/lba28/long/low
PASS 14 test-crypto-tlssession /qcrypto/tlssession/wildcard5
==6934==WARNING: ASan doesn't fully support makecontext/swapcontext functions and may produce false positives in some cases!
PASS 15 test-crypto-tlssession /qcrypto/tlssession/wildcard6
==6934==WARNING: ASan is ignoring requested __asan_handle_no_return: stack top: 0x7fff03c18000; bottom 0x7fb1bd1fe000; size: 0x004d46a1a000 (331897479168)
False positive error reports may follow
For details see https://github.com/google/sanitizers/issues/189
PASS 17 ahci-test /x86_64/ahci/io/pio/lba28/long/high
PASS 16 test-crypto-tlssession /qcrypto/tlssession/cachain
MALLOC_PERTURB_=${MALLOC_PERTURB_:-$(( ${RANDOM:-0} % 255 + 1))}  tests/test-qga -m=quick -k --tap < /dev/null | ./scripts/tap-driver.pl --test-name="test-qga" 
==6940==WARNING: ASan doesn't fully support makecontext/swapcontext functions and may produce false positives in some cases!
PASS 18 ahci-test /x86_64/ahci/io/pio/lba28/short/zero
==6954==WARNING: ASan doesn't fully support makecontext/swapcontext functions and may produce false positives in some cases!
PASS 1 test-qga /qga/sync-delimited
PASS 2 test-qga /qga/sync
PASS 3 test-qga /qga/ping
---
PASS 8 test-qga /qga/get-memory-block-info
PASS 9 test-qga /qga/get-memory-blocks
PASS 19 ahci-test /x86_64/ahci/io/pio/lba28/short/low
==6960==WARNING: ASan doesn't fully support makecontext/swapcontext functions and may produce false positives in some cases!
PASS 20 ahci-test /x86_64/ahci/io/pio/lba28/short/high
PASS 10 test-qga /qga/file-ops
PASS 11 test-qga /qga/file-write-read
---
PASS 15 test-qga /qga/invalid-cmd
PASS 16 test-qga /qga/invalid-args
PASS 17 test-qga /qga/fsfreeze-status
==6966==WARNING: ASan doesn't fully support makecontext/swapcontext functions and may produce false positives in some cases!
==6966==WARNING: ASan is ignoring requested __asan_handle_no_return: stack top: 0x7ffc02a49000; bottom 0x7f0dcbbfe000; size: 0x00ee36e4b000 (1023123173376)
False positive error reports may follow
For details see https://github.com/google/sanitizers/issues/189
PASS 21 ahci-test /x86_64/ahci/io/pio/lba48/simple/zero
---
PASS 19 test-qga /qga/config
PASS 20 test-qga /qga/guest-exec
PASS 21 test-qga /qga/guest-exec-invalid
==6975==WARNING: ASan doesn't fully support makecontext/swapcontext functions and may produce false positives in some cases!
==6975==WARNING: ASan is ignoring requested __asan_handle_no_return: stack top: 0x7ffe7f556000; bottom 0x7f951f1fe000; size: 0x006960358000 (452585684992)
False positive error reports may follow
For details see https://github.com/google/sanitizers/issues/189
PASS 22 ahci-test /x86_64/ahci/io/pio/lba48/simple/low
---
PASS 24 test-qga /qga/guest-get-timezone
PASS 25 test-qga /qga/guest-get-users
MALLOC_PERTURB_=${MALLOC_PERTURB_:-$(( ${RANDOM:-0} % 255 + 1))}  tests/test-timed-average -m=quick -k --tap < /dev/null | ./scripts/tap-driver.pl --test-name="test-timed-average" 
==6993==WARNING: ASan doesn't fully support makecontext/swapcontext functions and may produce false positives in some cases!
==6993==WARNING: ASan is ignoring requested __asan_handle_no_return: stack top: 0x7fffa7490000; bottom 0x7f899fffe000; size: 0x007607492000 (506928373760)
False positive error reports may follow
For details see https://github.com/google/sanitizers/issues/189
PASS 1 test-timed-average /timed-average/average
---
PASS 23 ahci-test /x86_64/ahci/io/pio/lba48/simple/high
PASS 1 test-util-filemonitor /util/filemonitor
MALLOC_PERTURB_=${MALLOC_PERTURB_:-$(( ${RANDOM:-0} % 255 + 1))}  tests/test-util-sockets -m=quick -k --tap < /dev/null | ./scripts/tap-driver.pl --test-name="test-util-sockets" 
==7009==WARNING: ASan doesn't fully support makecontext/swapcontext functions and may produce false positives in some cases!
PASS 1 test-util-sockets /util/socket/is-socket/bad
PASS 2 test-util-sockets /util/socket/is-socket/good
PASS 3 test-util-sockets /socket/fd-pass/name/good
---
PASS 7 test-util-sockets /socket/fd-pass/num/bad
PASS 8 test-util-sockets /socket/fd-pass/num/nocli
MALLOC_PERTURB_=${MALLOC_PERTURB_:-$(( ${RANDOM:-0} % 255 + 1))}  tests/test-authz-simple -m=quick -k --tap < /dev/null | ./scripts/tap-driver.pl --test-name="test-authz-simple" 
==7009==WARNING: ASan is ignoring requested __asan_handle_no_return: stack top: 0x7fff45b99000; bottom 0x7fa4fb7fe000; size: 0x005a4a39b000 (387792351232)
False positive error reports may follow
For details see https://github.com/google/sanitizers/issues/189
PASS 1 test-authz-simple /authz/simple
---
PASS 5 test-authz-list /auth/list/explicit/deny
PASS 6 test-authz-list /auth/list/explicit/allow
MALLOC_PERTURB_=${MALLOC_PERTURB_:-$(( ${RANDOM:-0} % 255 + 1))}  tests/test-authz-listfile -m=quick -k --tap < /dev/null | ./scripts/tap-driver.pl --test-name="test-authz-listfile" 
==7027==WARNING: ASan doesn't fully support makecontext/swapcontext functions and may produce false positives in some cases!
PASS 1 test-authz-listfile /auth/list/complex
PASS 2 test-authz-listfile /auth/list/default/deny
PASS 3 test-authz-listfile /auth/list/default/allow
PASS 4 test-authz-listfile /auth/list/explicit/deny
PASS 5 test-authz-listfile /auth/list/explicit/allow
MALLOC_PERTURB_=${MALLOC_PERTURB_:-$(( ${RANDOM:-0} % 255 + 1))}  tests/test-io-task -m=quick -k --tap < /dev/null | ./scripts/tap-driver.pl --test-name="test-io-task" 
==7027==WARNING: ASan is ignoring requested __asan_handle_no_return: stack top: 0x7ffc24c15000; bottom 0x7fa9d9ffe000; size: 0x00524ac17000 (353441509376)
False positive error reports may follow
For details see https://github.com/google/sanitizers/issues/189
PASS 1 test-io-task /crypto/task/complete
---
PASS 4 test-io-channel-file /io/channel/pipe/sync
PASS 5 test-io-channel-file /io/channel/pipe/async
MALLOC_PERTURB_=${MALLOC_PERTURB_:-$(( ${RANDOM:-0} % 255 + 1))}  tests/test-io-channel-tls -m=quick -k --tap < /dev/null | ./scripts/tap-driver.pl --test-name="test-io-channel-tls" 
==7049==WARNING: ASan doesn't fully support makecontext/swapcontext functions and may produce false positives in some cases!
==7049==WARNING: ASan is ignoring requested __asan_handle_no_return: stack top: 0x7fffb556a000; bottom 0x7f7b6c7fe000; size: 0x008448d6c000 (568157716480)
False positive error reports may follow
For details see https://github.com/google/sanitizers/issues/189
PASS 26 ahci-test /x86_64/ahci/io/pio/lba48/double/high
---
PASS 3 test-io-channel-command /io/channel/command/echo/sync
PASS 4 test-io-channel-command /io/channel/command/echo/async
MALLOC_PERTURB_=${MALLOC_PERTURB_:-$(( ${RANDOM:-0} % 255 + 1))}  tests/test-io-channel-buffer -m=quick -k --tap < /dev/null | ./scripts/tap-driver.pl --test-name="test-io-channel-buffer" 
==7105==WARNING: ASan doesn't fully support makecontext/swapcontext functions and may produce false positives in some cases!
PASS 1 test-io-channel-buffer /io/channel/buf
MALLOC_PERTURB_=${MALLOC_PERTURB_:-$(( ${RANDOM:-0} % 255 + 1))}  tests/test-base64 -m=quick -k --tap < /dev/null | ./scripts/tap-driver.pl --test-name="test-base64" 
==7105==WARNING: ASan is ignoring requested __asan_handle_no_return: stack top: 0x7ffcc2f94000; bottom 0x7f01bfdfe000; size: 0x00fb03196000 (1078088785920)
False positive error reports may follow
For details see https://github.com/google/sanitizers/issues/189
PASS 1 test-base64 /util/base64/good
---
PASS 3 test-crypto-afsplit /crypto/afsplit/sha256/big
PASS 4 test-crypto-afsplit /crypto/afsplit/sha1/1000
MALLOC_PERTURB_=${MALLOC_PERTURB_:-$(( ${RANDOM:-0} % 255 + 1))}  tests/test-crypto-xts -m=quick -k --tap < /dev/null | ./scripts/tap-driver.pl --test-name="test-crypto-xts" 
==7130==WARNING: ASan doesn't fully support makecontext/swapcontext functions and may produce false positives in some cases!
PASS 1 test-crypto-xts /crypto/xts/t-1-key-32-ptx-32/basic
PASS 2 test-crypto-xts /crypto/xts/t-1-key-32-ptx-32/split
PASS 3 test-crypto-xts /crypto/xts/t-1-key-32-ptx-32/unaligned
---
MALLOC_PERTURB_=${MALLOC_PERTURB_:-$(( ${RANDOM:-0} % 255 + 1))}  tests/test-crypto-block -m=quick -k --tap < /dev/null | ./scripts/tap-driver.pl --test-name="test-crypto-block" 
PASS 1 test-crypto-block /crypto/block/qcow
MALLOC_PERTURB_=${MALLOC_PERTURB_:-$(( ${RANDOM:-0} % 255 + 1))}  tests/test-logging -m=quick -k --tap < /dev/null | ./scripts/tap-driver.pl --test-name="test-logging" 
==7130==WARNING: ASan is ignoring requested __asan_handle_no_return: stack top: 0x7ffd2aa90000; bottom 0x7fcb2dffe000; size: 0x0031fca92000 (214692339712)
False positive error reports may follow
For details see https://github.com/google/sanitizers/issues/189
PASS 1 test-logging /logging/parse_range
---
PASS 4 test-logging /logging/logfile_lock_path
MALLOC_PERTURB_=${MALLOC_PERTURB_:-$(( ${RANDOM:-0} % 255 + 1))}  tests/test-replication -m=quick -k --tap < /dev/null | ./scripts/tap-driver.pl --test-name="test-replication" 
PASS 28 ahci-test /x86_64/ahci/io/pio/lba48/long/low
==7153==WARNING: ASan doesn't fully support makecontext/swapcontext functions and may produce false positives in some cases!
PASS 1 test-replication /replication/primary/read
PASS 2 test-replication /replication/primary/write
==7155==WARNING: ASan doesn't fully support makecontext/swapcontext functions and may produce false positives in some cases!
==7155==WARNING: ASan is ignoring requested __asan_handle_no_return: stack top: 0x7ffe6b77c000; bottom 0x7fa97637c000; size: 0x0054f5400000 (364891865088)
False positive error reports may follow
For details see https://github.com/google/sanitizers/issues/189
PASS 3 test-replication /replication/primary/start
---
PASS 5 test-replication /replication/primary/do_checkpoint
PASS 6 test-replication /replication/primary/get_error_all
PASS 29 ahci-test /x86_64/ahci/io/pio/lba48/long/high
==7163==WARNING: ASan doesn't fully support makecontext/swapcontext functions and may produce false positives in some cases!
PASS 30 ahci-test /x86_64/ahci/io/pio/lba48/short/zero
PASS 7 test-replication /replication/secondary/read
==7169==WARNING: ASan doesn't fully support makecontext/swapcontext functions and may produce false positives in some cases!
PASS 8 test-replication /replication/secondary/write
PASS 31 ahci-test /x86_64/ahci/io/pio/lba48/short/low
==7175==WARNING: ASan doesn't fully support makecontext/swapcontext functions and may produce false positives in some cases!
PASS 32 ahci-test /x86_64/ahci/io/pio/lba48/short/high
==7181==WARNING: ASan doesn't fully support makecontext/swapcontext functions and may produce false positives in some cases!
PASS 33 ahci-test /x86_64/ahci/io/dma/lba28/fragmented
==7153==WARNING: ASan is ignoring requested __asan_handle_no_return: stack top: 0x7ffed1570000; bottom 0x7f17acdc2000; size: 0x00e7247ae000 (992749477888)
False positive error reports may follow
For details see https://github.com/google/sanitizers/issues/189
==7188==WARNING: ASan doesn't fully support makecontext/swapcontext functions and may produce false positives in some cases!
PASS 9 test-replication /replication/secondary/start
PASS 34 ahci-test /x86_64/ahci/io/dma/lba28/retry
==7212==WARNING: ASan doesn't fully support makecontext/swapcontext functions and may produce false positives in some cases!
PASS 35 ahci-test /x86_64/ahci/io/dma/lba28/simple/zero
==7218==WARNING: ASan doesn't fully support makecontext/swapcontext functions and may produce false positives in some cases!
PASS 36 ahci-test /x86_64/ahci/io/dma/lba28/simple/low
==7224==WARNING: ASan doesn't fully support makecontext/swapcontext functions and may produce false positives in some cases!
PASS 37 ahci-test /x86_64/ahci/io/dma/lba28/simple/high
PASS 10 test-replication /replication/secondary/stop
==7230==WARNING: ASan doesn't fully support makecontext/swapcontext functions and may produce false positives in some cases!
PASS 38 ahci-test /x86_64/ahci/io/dma/lba28/double/zero
==7236==WARNING: ASan doesn't fully support makecontext/swapcontext functions and may produce false positives in some cases!
PASS 39 ahci-test /x86_64/ahci/io/dma/lba28/double/low
==7242==WARNING: ASan doesn't fully support makecontext/swapcontext functions and may produce false positives in some cases!
PASS 40 ahci-test /x86_64/ahci/io/dma/lba28/double/high
PASS 11 test-replication /replication/secondary/continuous_replication
==7248==WARNING: ASan doesn't fully support makecontext/swapcontext functions and may produce false positives in some cases!
==7248==WARNING: ASan is ignoring requested __asan_handle_no_return: stack top: 0x7fffb262a000; bottom 0x7f909cffd000; size: 0x006f1562d000 (477100167168)
False positive error reports may follow
For details see https://github.com/google/sanitizers/issues/189
PASS 41 ahci-test /x86_64/ahci/io/dma/lba28/long/zero
==7255==WARNING: ASan doesn't fully support makecontext/swapcontext functions and may produce false positives in some cases!
==7255==WARNING: ASan is ignoring requested __asan_handle_no_return: stack top: 0x7ffdc328e000; bottom 0x7f7808d7b000; size: 0x0085ba513000 (574356533248)
False positive error reports may follow
For details see https://github.com/google/sanitizers/issues/189
PASS 42 ahci-test /x86_64/ahci/io/dma/lba28/long/low
PASS 12 test-replication /replication/secondary/do_checkpoint
==7262==WARNING: ASan doesn't fully support makecontext/swapcontext functions and may produce false positives in some cases!
==7262==WARNING: ASan is ignoring requested __asan_handle_no_return: stack top: 0x7ffe62abb000; bottom 0x7fa4be57b000; size: 0x0059a4540000 (385009057792)
False positive error reports may follow
For details see https://github.com/google/sanitizers/issues/189
PASS 13 test-replication /replication/secondary/get_error_all
PASS 43 ahci-test /x86_64/ahci/io/dma/lba28/long/high
MALLOC_PERTURB_=${MALLOC_PERTURB_:-$(( ${RANDOM:-0} % 255 + 1))}  tests/test-bufferiszero -m=quick -k --tap < /dev/null | ./scripts/tap-driver.pl --test-name="test-bufferiszero" 
==7269==WARNING: ASan doesn't fully support makecontext/swapcontext functions and may produce false positives in some cases!
PASS 44 ahci-test /x86_64/ahci/io/dma/lba28/short/zero
==7278==WARNING: ASan doesn't fully support makecontext/swapcontext functions and may produce false positives in some cases!
PASS 45 ahci-test /x86_64/ahci/io/dma/lba28/short/low
==7284==WARNING: ASan doesn't fully support makecontext/swapcontext functions and may produce false positives in some cases!
PASS 46 ahci-test /x86_64/ahci/io/dma/lba28/short/high
==7290==WARNING: ASan doesn't fully support makecontext/swapcontext functions and may produce false positives in some cases!
PASS 47 ahci-test /x86_64/ahci/io/dma/lba48/simple/zero
==7296==WARNING: ASan doesn't fully support makecontext/swapcontext functions and may produce false positives in some cases!
PASS 48 ahci-test /x86_64/ahci/io/dma/lba48/simple/low
==7302==WARNING: ASan doesn't fully support makecontext/swapcontext functions and may produce false positives in some cases!
PASS 49 ahci-test /x86_64/ahci/io/dma/lba48/simple/high
==7308==WARNING: ASan doesn't fully support makecontext/swapcontext functions and may produce false positives in some cases!
PASS 50 ahci-test /x86_64/ahci/io/dma/lba48/double/zero
==7314==WARNING: ASan doesn't fully support makecontext/swapcontext functions and may produce false positives in some cases!
PASS 51 ahci-test /x86_64/ahci/io/dma/lba48/double/low
==7320==WARNING: ASan doesn't fully support makecontext/swapcontext functions and may produce false positives in some cases!
PASS 52 ahci-test /x86_64/ahci/io/dma/lba48/double/high
==7326==WARNING: ASan doesn't fully support makecontext/swapcontext functions and may produce false positives in some cases!
==7326==WARNING: ASan is ignoring requested __asan_handle_no_return: stack top: 0x7ffd31b81000; bottom 0x7f92103fd000; size: 0x006b21784000 (460123029504)
False positive error reports may follow
For details see https://github.com/google/sanitizers/issues/189
PASS 53 ahci-test /x86_64/ahci/io/dma/lba48/long/zero
==7333==WARNING: ASan doesn't fully support makecontext/swapcontext functions and may produce false positives in some cases!
==7333==WARNING: ASan is ignoring requested __asan_handle_no_return: stack top: 0x7fffb24a1000; bottom 0x7fc5847fd000; size: 0x003a2dca4000 (249876332544)
False positive error reports may follow
For details see https://github.com/google/sanitizers/issues/189
PASS 54 ahci-test /x86_64/ahci/io/dma/lba48/long/low
==7340==WARNING: ASan doesn't fully support makecontext/swapcontext functions and may produce false positives in some cases!
==7340==WARNING: ASan is ignoring requested __asan_handle_no_return: stack top: 0x7fff5893d000; bottom 0x7f3d109fd000; size: 0x00c247f40000 (834430828544)
False positive error reports may follow
For details see https://github.com/google/sanitizers/issues/189
PASS 55 ahci-test /x86_64/ahci/io/dma/lba48/long/high
==7347==WARNING: ASan doesn't fully support makecontext/swapcontext functions and may produce false positives in some cases!
PASS 56 ahci-test /x86_64/ahci/io/dma/lba48/short/zero
==7353==WARNING: ASan doesn't fully support makecontext/swapcontext functions and may produce false positives in some cases!
PASS 57 ahci-test /x86_64/ahci/io/dma/lba48/short/low
==7359==WARNING: ASan doesn't fully support makecontext/swapcontext functions and may produce false positives in some cases!
PASS 58 ahci-test /x86_64/ahci/io/dma/lba48/short/high
==7365==WARNING: ASan doesn't fully support makecontext/swapcontext functions and may produce false positives in some cases!
PASS 59 ahci-test /x86_64/ahci/io/ncq/simple
==7371==WARNING: ASan doesn't fully support makecontext/swapcontext functions and may produce false positives in some cases!
PASS 60 ahci-test /x86_64/ahci/io/ncq/retry
==7377==WARNING: ASan doesn't fully support makecontext/swapcontext functions and may produce false positives in some cases!
PASS 61 ahci-test /x86_64/ahci/flush/simple
==7383==WARNING: ASan doesn't fully support makecontext/swapcontext functions and may produce false positives in some cases!
PASS 62 ahci-test /x86_64/ahci/flush/retry
==7389==WARNING: ASan doesn't fully support makecontext/swapcontext functions and may produce false positives in some cases!
==7395==WARNING: ASan doesn't fully support makecontext/swapcontext functions and may produce false positives in some cases!
PASS 63 ahci-test /x86_64/ahci/flush/migrate
==7403==WARNING: ASan doesn't fully support makecontext/swapcontext functions and may produce false positives in some cases!
==7409==WARNING: ASan doesn't fully support makecontext/swapcontext functions and may produce false positives in some cases!
PASS 64 ahci-test /x86_64/ahci/migrate/sanity
==7417==WARNING: ASan doesn't fully support makecontext/swapcontext functions and may produce false positives in some cases!
==7423==WARNING: ASan doesn't fully support makecontext/swapcontext functions and may produce false positives in some cases!
PASS 65 ahci-test /x86_64/ahci/migrate/dma/simple
==7431==WARNING: ASan doesn't fully support makecontext/swapcontext functions and may produce false positives in some cases!
==7437==WARNING: ASan doesn't fully support makecontext/swapcontext functions and may produce false positives in some cases!
PASS 1 test-bufferiszero /cutils/bufferiszero
MALLOC_PERTURB_=${MALLOC_PERTURB_:-$(( ${RANDOM:-0} % 255 + 1))}  tests/test-uuid -m=quick -k --tap < /dev/null | ./scripts/tap-driver.pl --test-name="test-uuid" 
PASS 66 ahci-test /x86_64/ahci/migrate/dma/halted
---
PASS 314 ptimer-test /ptimer/on_the_fly_period_change policy=no_immediate_trigger,no_immediate_reload,no_counter_rounddown,
PASS 315 ptimer-test /ptimer/on_the_fly_freq_change policy=no_immediate_trigger,no_immediate_reload,no_counter_rounddown,
PASS 316 ptimer-test /ptimer/run_with_period_0 policy=no_immediate_trigger,no_immediate_reload,no_counter_rounddown,
==7448==WARNING: ASan doesn't fully support makecontext/swapcontext functions and may produce false positives in some cases!
PASS 317 ptimer-test /ptimer/run_with_delta_0 policy=no_immediate_trigger,no_immediate_reload,no_counter_rounddown,
PASS 318 ptimer-test /ptimer/periodic_with_load_0 policy=no_immediate_trigger,no_immediate_reload,no_counter_rounddown,
PASS 319 ptimer-test /ptimer/oneshot_with_load_0 policy=no_immediate_trigger,no_immediate_reload,no_counter_rounddown,
---
PASS 21 test-qgraph /qgraph/test_two_test_same_interface
PASS 22 test-qgraph /qgraph/test_test_in_path
PASS 23 test-qgraph /qgraph/test_double_edge
==7461==WARNING: ASan doesn't fully support makecontext/swapcontext functions and may produce false positives in some cases!
PASS 67 ahci-test /x86_64/ahci/migrate/ncq/simple
==7472==WARNING: ASan doesn't fully support makecontext/swapcontext functions and may produce false positives in some cases!
==7478==WARNING: ASan doesn't fully support makecontext/swapcontext functions and may produce false positives in some cases!
PASS 68 ahci-test /x86_64/ahci/migrate/ncq/halted
==7486==WARNING: ASan doesn't fully support makecontext/swapcontext functions and may produce false positives in some cases!
PASS 69 ahci-test /x86_64/ahci/cdrom/eject
==7491==WARNING: ASan doesn't fully support makecontext/swapcontext functions and may produce false positives in some cases!
PASS 70 ahci-test /x86_64/ahci/cdrom/dma/single
==7497==WARNING: ASan doesn't fully support makecontext/swapcontext functions and may produce false positives in some cases!
PASS 71 ahci-test /x86_64/ahci/cdrom/dma/multi
==7503==WARNING: ASan doesn't fully support makecontext/swapcontext functions and may produce false positives in some cases!
PASS 72 ahci-test /x86_64/ahci/cdrom/pio/single
==7509==WARNING: ASan doesn't fully support makecontext/swapcontext functions and may produce false positives in some cases!
==7509==WARNING: ASan is ignoring requested __asan_handle_no_return: stack top: 0x7fff464cf000; bottom 0x7fa876ffe000; size: 0x0056cf4d1000 (372845121536)
False positive error reports may follow
For details see https://github.com/google/sanitizers/issues/189
PASS 73 ahci-test /x86_64/ahci/cdrom/pio/multi
==7515==WARNING: ASan doesn't fully support makecontext/swapcontext functions and may produce false positives in some cases!
PASS 74 ahci-test /x86_64/ahci/cdrom/pio/bcl
MALLOC_PERTURB_=${MALLOC_PERTURB_:-$(( ${RANDOM:-0} % 255 + 1))}  QTEST_QEMU_BINARY=x86_64-softmmu/qemu-system-x86_64 QTEST_QEMU_IMG=qemu-img tests/qtest/hd-geo-test -m=quick -k --tap < /dev/null | ./scripts/tap-driver.pl --test-name="hd-geo-test" 
PASS 1 hd-geo-test /x86_64/hd-geo/ide/none
==7529==WARNING: ASan doesn't fully support makecontext/swapcontext functions and may produce false positives in some cases!
PASS 2 hd-geo-test /x86_64/hd-geo/ide/drive/cd_0
==7535==WARNING: ASan doesn't fully support makecontext/swapcontext functions and may produce false positives in some cases!
PASS 3 hd-geo-test /x86_64/hd-geo/ide/drive/mbr/blank
==7541==WARNING: ASan doesn't fully support makecontext/swapcontext functions and may produce false positives in some cases!
PASS 4 hd-geo-test /x86_64/hd-geo/ide/drive/mbr/lba
==7547==WARNING: ASan doesn't fully support makecontext/swapcontext functions and may produce false positives in some cases!
PASS 5 hd-geo-test /x86_64/hd-geo/ide/drive/mbr/chs
==7553==WARNING: ASan doesn't fully support makecontext/swapcontext functions and may produce false positives in some cases!
PASS 6 hd-geo-test /x86_64/hd-geo/ide/device/mbr/blank
==7559==WARNING: ASan doesn't fully support makecontext/swapcontext functions and may produce false positives in some cases!
PASS 7 hd-geo-test /x86_64/hd-geo/ide/device/mbr/lba
==7565==WARNING: ASan doesn't fully support makecontext/swapcontext functions and may produce false positives in some cases!
PASS 8 hd-geo-test /x86_64/hd-geo/ide/device/mbr/chs
==7571==WARNING: ASan doesn't fully support makecontext/swapcontext functions and may produce false positives in some cases!
PASS 9 hd-geo-test /x86_64/hd-geo/ide/device/user/chs
==7576==WARNING: ASan doesn't fully support makecontext/swapcontext functions and may produce false positives in some cases!
PASS 10 hd-geo-test /x86_64/hd-geo/ide/device/user/chst
==7582==WARNING: ASan doesn't fully support makecontext/swapcontext functions and may produce false positives in some cases!
==7586==WARNING: ASan doesn't fully support makecontext/swapcontext functions and may produce false positives in some cases!
==7590==WARNING: ASan doesn't fully support makecontext/swapcontext functions and may produce false positives in some cases!
==7594==WARNING: ASan doesn't fully support makecontext/swapcontext functions and may produce false positives in some cases!
==7598==WARNING: ASan doesn't fully support makecontext/swapcontext functions and may produce false positives in some cases!
==7602==WARNING: ASan doesn't fully support makecontext/swapcontext functions and may produce false positives in some cases!
==7606==WARNING: ASan doesn't fully support makecontext/swapcontext functions and may produce false positives in some cases!
==7610==WARNING: ASan doesn't fully support makecontext/swapcontext functions and may produce false positives in some cases!
==7613==WARNING: ASan doesn't fully support makecontext/swapcontext functions and may produce false positives in some cases!
PASS 11 hd-geo-test /x86_64/hd-geo/override/ide
==7620==WARNING: ASan doesn't fully support makecontext/swapcontext functions and may produce false positives in some cases!
==7624==WARNING: ASan doesn't fully support makecontext/swapcontext functions and may produce false positives in some cases!
==7628==WARNING: ASan doesn't fully support makecontext/swapcontext functions and may produce false positives in some cases!
==7632==WARNING: ASan doesn't fully support makecontext/swapcontext functions and may produce false positives in some cases!
==7636==WARNING: ASan doesn't fully support makecontext/swapcontext functions and may produce false positives in some cases!
==7640==WARNING: ASan doesn't fully support makecontext/swapcontext functions and may produce false positives in some cases!
==7644==WARNING: ASan doesn't fully support makecontext/swapcontext functions and may produce false positives in some cases!
==7648==WARNING: ASan doesn't fully support makecontext/swapcontext functions and may produce false positives in some cases!
==7651==WARNING: ASan doesn't fully support makecontext/swapcontext functions and may produce false positives in some cases!
PASS 12 hd-geo-test /x86_64/hd-geo/override/scsi
==7658==WARNING: ASan doesn't fully support makecontext/swapcontext functions and may produce false positives in some cases!
==7662==WARNING: ASan doesn't fully support makecontext/swapcontext functions and may produce false positives in some cases!
==7666==WARNING: ASan doesn't fully support makecontext/swapcontext functions and may produce false positives in some cases!
==7670==WARNING: ASan doesn't fully support makecontext/swapcontext functions and may produce false positives in some cases!
==7674==WARNING: ASan doesn't fully support makecontext/swapcontext functions and may produce false positives in some cases!
==7678==WARNING: ASan doesn't fully support makecontext/swapcontext functions and may produce false positives in some cases!
==7682==WARNING: ASan doesn't fully support makecontext/swapcontext functions and may produce false positives in some cases!
==7686==WARNING: ASan doesn't fully support makecontext/swapcontext functions and may produce false positives in some cases!
==7689==WARNING: ASan doesn't fully support makecontext/swapcontext functions and may produce false positives in some cases!
PASS 13 hd-geo-test /x86_64/hd-geo/override/scsi_2_controllers
==7696==WARNING: ASan doesn't fully support makecontext/swapcontext functions and may produce false positives in some cases!
==7700==WARNING: ASan doesn't fully support makecontext/swapcontext functions and may produce false positives in some cases!
==7704==WARNING: ASan doesn't fully support makecontext/swapcontext functions and may produce false positives in some cases!
==7708==WARNING: ASan doesn't fully support makecontext/swapcontext functions and may produce false positives in some cases!
==7711==WARNING: ASan doesn't fully support makecontext/swapcontext functions and may produce false positives in some cases!
PASS 14 hd-geo-test /x86_64/hd-geo/override/virtio_blk
==7718==WARNING: ASan doesn't fully support makecontext/swapcontext functions and may produce false positives in some cases!
==7722==WARNING: ASan doesn't fully support makecontext/swapcontext functions and may produce false positives in some cases!
==7725==WARNING: ASan doesn't fully support makecontext/swapcontext functions and may produce false positives in some cases!
PASS 15 hd-geo-test /x86_64/hd-geo/override/zero_chs
==7732==WARNING: ASan doesn't fully support makecontext/swapcontext functions and may produce false positives in some cases!
==7736==WARNING: ASan doesn't fully support makecontext/swapcontext functions and may produce false positives in some cases!
==7740==WARNING: ASan doesn't fully support makecontext/swapcontext functions and may produce false positives in some cases!
==7744==WARNING: ASan doesn't fully support makecontext/swapcontext functions and may produce false positives in some cases!
==7747==WARNING: ASan doesn't fully support makecontext/swapcontext functions and may produce false positives in some cases!
PASS 16 hd-geo-test /x86_64/hd-geo/override/scsi_hot_unplug
==7754==WARNING: ASan doesn't fully support makecontext/swapcontext functions and may produce false positives in some cases!
==7758==WARNING: ASan doesn't fully support makecontext/swapcontext functions and may produce false positives in some cases!
==7762==WARNING: ASan doesn't fully support makecontext/swapcontext functions and may produce false positives in some cases!
==7766==WARNING: ASan doesn't fully support makecontext/swapcontext functions and may produce false positives in some cases!
==7769==WARNING: ASan doesn't fully support makecontext/swapcontext functions and may produce false positives in some cases!
PASS 17 hd-geo-test /x86_64/hd-geo/override/virtio_hot_unplug
MALLOC_PERTURB_=${MALLOC_PERTURB_:-$(( ${RANDOM:-0} % 255 + 1))}  QTEST_QEMU_BINARY=x86_64-softmmu/qemu-system-x86_64 QTEST_QEMU_IMG=qemu-img tests/qtest/boot-order-test -m=quick -k --tap < /dev/null | ./scripts/tap-driver.pl --test-name="boot-order-test" 
PASS 1 boot-order-test /x86_64/boot-order/pc
---
Could not access KVM kernel module: No such file or directory
qemu-system-x86_64: -accel kvm: failed to initialize kvm: No such file or directory
qemu-system-x86_64: falling back to tcg
==7838==WARNING: ASan doesn't fully support makecontext/swapcontext functions and may produce false positives in some cases!

Looking for expected file 'tests/data/acpi/pc/FACP'
Using expected file 'tests/data/acpi/pc/FACP'
---
Could not access KVM kernel module: No such file or directory
qemu-system-x86_64: -accel kvm: failed to initialize kvm: No such file or directory
qemu-system-x86_64: falling back to tcg
==7844==WARNING: ASan doesn't fully support makecontext/swapcontext functions and may produce false positives in some cases!

Looking for expected file 'tests/data/acpi/q35/FACP'
Using expected file 'tests/data/acpi/q35/FACP'
---
Could not access KVM kernel module: No such file or directory
qemu-system-x86_64: -accel kvm: failed to initialize kvm: No such file or directory
qemu-system-x86_64: falling back to tcg
==7850==WARNING: ASan doesn't fully support makecontext/swapcontext functions and may produce false positives in some cases!

Looking for expected file 'tests/data/acpi/pc/FACP.bridge'
Looking for expected file 'tests/data/acpi/pc/FACP'
---
Could not access KVM kernel module: No such file or directory
qemu-system-x86_64: -accel kvm: failed to initialize kvm: No such file or directory
qemu-system-x86_64: falling back to tcg
==7856==WARNING: ASan doesn't fully support makecontext/swapcontext functions and may produce false positives in some cases!

Looking for expected file 'tests/data/acpi/pc/FACP.ipmikcs'
Looking for expected file 'tests/data/acpi/pc/FACP'
---
Could not access KVM kernel module: No such file or directory
qemu-system-x86_64: -accel kvm: failed to initialize kvm: No such file or directory
qemu-system-x86_64: falling back to tcg
==7862==WARNING: ASan doesn't fully support makecontext/swapcontext functions and may produce false positives in some cases!

Looking for expected file 'tests/data/acpi/pc/FACP.cphp'
Looking for expected file 'tests/data/acpi/pc/FACP'
---
Could not access KVM kernel module: No such file or directory
qemu-system-x86_64: -accel kvm: failed to initialize kvm: No such file or directory
qemu-system-x86_64: falling back to tcg
==7869==WARNING: ASan doesn't fully support makecontext/swapcontext functions and may produce false positives in some cases!

Looking for expected file 'tests/data/acpi/pc/FACP.memhp'
Looking for expected file 'tests/data/acpi/pc/FACP'
---
Could not access KVM kernel module: No such file or directory
qemu-system-x86_64: -accel kvm: failed to initialize kvm: No such file or directory
qemu-system-x86_64: falling back to tcg
==7875==WARNING: ASan doesn't fully support makecontext/swapcontext functions and may produce false positives in some cases!

Looking for expected file 'tests/data/acpi/pc/FACP.numamem'
Looking for expected file 'tests/data/acpi/pc/FACP'
---
Could not access KVM kernel module: No such file or directory
qemu-system-x86_64: -accel kvm: failed to initialize kvm: No such file or directory
qemu-system-x86_64: falling back to tcg
==7881==WARNING: ASan doesn't fully support makecontext/swapcontext functions and may produce false positives in some cases!

Looking for expected file 'tests/data/acpi/pc/FACP.dimmpxm'
Looking for expected file 'tests/data/acpi/pc/FACP'
---
Could not access KVM kernel module: No such file or directory
qemu-system-x86_64: -accel kvm: failed to initialize kvm: No such file or directory
qemu-system-x86_64: falling back to tcg
==7890==WARNING: ASan doesn't fully support makecontext/swapcontext functions and may produce false positives in some cases!

Looking for expected file 'tests/data/acpi/pc/FACP.acpihmat'
Looking for expected file 'tests/data/acpi/pc/FACP'
---
Could not access KVM kernel module: No such file or directory
qemu-system-x86_64: -accel kvm: failed to initialize kvm: No such file or directory
qemu-system-x86_64: falling back to tcg
==7897==WARNING: ASan doesn't fully support makecontext/swapcontext functions and may produce false positives in some cases!

Looking for expected file 'tests/data/acpi/q35/FACP.bridge'
Looking for expected file 'tests/data/acpi/q35/FACP'
---
Could not access KVM kernel module: No such file or directory
qemu-system-x86_64: -accel kvm: failed to initialize kvm: No such file or directory
qemu-system-x86_64: falling back to tcg
==7903==WARNING: ASan doesn't fully support makecontext/swapcontext functions and may produce false positives in some cases!

Looking for expected file 'tests/data/acpi/q35/FACP.mmio64'
Looking for expected file 'tests/data/acpi/q35/FACP'
---
Could not access KVM kernel module: No such file or directory
qemu-system-x86_64: -accel kvm: failed to initialize kvm: No such file or directory
qemu-system-x86_64: falling back to tcg
==7909==WARNING: ASan doesn't fully support makecontext/swapcontext functions and may produce false positives in some cases!

Looking for expected file 'tests/data/acpi/q35/FACP.ipmibt'
Looking for expected file 'tests/data/acpi/q35/FACP'
---
Could not access KVM kernel module: No such file or directory
qemu-system-x86_64: -accel kvm: failed to initialize kvm: No such file or directory
qemu-system-x86_64: falling back to tcg
==7915==WARNING: ASan doesn't fully support makecontext/swapcontext functions and may produce false positives in some cases!

Looking for expected file 'tests/data/acpi/q35/FACP.cphp'
Looking for expected file 'tests/data/acpi/q35/FACP'
---
Could not access KVM kernel module: No such file or directory
qemu-system-x86_64: -accel kvm: failed to initialize kvm: No such file or directory
qemu-system-x86_64: falling back to tcg
==7922==WARNING: ASan doesn't fully support makecontext/swapcontext functions and may produce false positives in some cases!

Looking for expected file 'tests/data/acpi/q35/FACP.memhp'
Looking for expected file 'tests/data/acpi/q35/FACP'
---
Could not access KVM kernel module: No such file or directory
qemu-system-x86_64: -accel kvm: failed to initialize kvm: No such file or directory
qemu-system-x86_64: falling back to tcg
==7928==WARNING: ASan doesn't fully support makecontext/swapcontext functions and may produce false positives in some cases!

Looking for expected file 'tests/data/acpi/q35/FACP.numamem'
Looking for expected file 'tests/data/acpi/q35/FACP'
---
Could not access KVM kernel module: No such file or directory
qemu-system-x86_64: -accel kvm: failed to initialize kvm: No such file or directory
qemu-system-x86_64: falling back to tcg
==7934==WARNING: ASan doesn't fully support makecontext/swapcontext functions and may produce false positives in some cases!

Looking for expected file 'tests/data/acpi/q35/FACP.dimmpxm'
Looking for expected file 'tests/data/acpi/q35/FACP'
---
Could not access KVM kernel module: No such file or directory
qemu-system-x86_64: -accel kvm: failed to initialize kvm: No such file or directory
qemu-system-x86_64: falling back to tcg
==7943==WARNING: ASan doesn't fully support makecontext/swapcontext functions and may produce false positives in some cases!

Looking for expected file 'tests/data/acpi/q35/FACP.acpihmat'
Looking for expected file 'tests/data/acpi/q35/FACP'
---
PASS 1 i440fx-test /x86_64/i440fx/defaults
PASS 2 i440fx-test /x86_64/i440fx/pam
PASS 3 i440fx-test /x86_64/i440fx/firmware/bios
==8035==WARNING: ASan doesn't fully support makecontext/swapcontext functions and may produce false positives in some cases!
PASS 4 i440fx-test /x86_64/i440fx/firmware/pflash
MALLOC_PERTURB_=${MALLOC_PERTURB_:-$(( ${RANDOM:-0} % 255 + 1))}  QTEST_QEMU_BINARY=x86_64-softmmu/qemu-system-x86_64 QTEST_QEMU_IMG=qemu-img tests/qtest/fw_cfg-test -m=quick -k --tap < /dev/null | ./scripts/tap-driver.pl --test-name="fw_cfg-test" 
PASS 1 fw_cfg-test /x86_64/fw_cfg/signature
---
MALLOC_PERTURB_=${MALLOC_PERTURB_:-$(( ${RANDOM:-0} % 255 + 1))}  QTEST_QEMU_BINARY=x86_64-softmmu/qemu-system-x86_64 QTEST_QEMU_IMG=qemu-img tests/qtest/drive_del-test -m=quick -k --tap < /dev/null | ./scripts/tap-driver.pl --test-name="drive_del-test" 
PASS 1 drive_del-test /x86_64/drive_del/without-dev
PASS 2 drive_del-test /x86_64/drive_del/after_failed_device_add
==8128==WARNING: ASan doesn't fully support makecontext/swapcontext functions and may produce false positives in some cases!
PASS 3 drive_del-test /x86_64/blockdev/drive_del_device_del
MALLOC_PERTURB_=${MALLOC_PERTURB_:-$(( ${RANDOM:-0} % 255 + 1))}  QTEST_QEMU_BINARY=x86_64-softmmu/qemu-system-x86_64 QTEST_QEMU_IMG=qemu-img tests/qtest/wdt_ib700-test -m=quick -k --tap < /dev/null | ./scripts/tap-driver.pl --test-name="wdt_ib700-test" 
PASS 1 wdt_ib700-test /x86_64/wdt_ib700/pause
---
dbus-daemon[8298]: Could not get password database information for UID of current process: User "???" unknown or no memory to allocate password entry

**
ERROR:/tmp/qemu-test/src/tests/qtest/dbus-vmstate-test.c:114:get_connection: assertion failed (err == NULL): The connection is closed (g-io-error-quark, 18)
cleaning up pid 8298
ERROR - Bail out! ERROR:/tmp/qemu-test/src/tests/qtest/dbus-vmstate-test.c:114:get_connection: assertion failed (err == NULL): The connection is closed (g-io-error-quark, 18)
make: *** [/tmp/qemu-test/src/tests/Makefile.include:632: check-qtest-x86_64] Error 1
make: *** Waiting for unfinished jobs....
Traceback (most recent call last):
  File "./tests/docker/docker.py", line 664, in <module>
---
    raise CalledProcessError(retcode, cmd)
subprocess.CalledProcessError: Command '['sudo', '-n', 'docker', 'run', '--label', 'com.qemu.instance.uuid=9ac323dbba8b4fb2aa1db9bd549d4211', '-u', '1003', '--security-opt', 'seccomp=unconfined', '--rm', '-e', 'TARGET_LIST=x86_64-softmmu', '-e', 'EXTRA_CONFIGURE_OPTS=', '-e', 'V=', '-e', 'J=14', '-e', 'DEBUG=', '-e', 'SHOW_ENV=', '-e', 'CCACHE_DIR=/var/tmp/ccache', '-v', '/home/patchew2/.cache/qemu-docker-ccache:/var/tmp/ccache:z', '-v', '/var/tmp/patchew-tester-tmp-jwaagcle/src/docker-src.2020-03-10-18.11.40.9403:/var/tmp/qemu:z,ro', 'qemu:fedora', '/var/tmp/qemu/run', 'test-debug']' returned non-zero exit status 2.
filter=--filter=label=com.qemu.instance.uuid=9ac323dbba8b4fb2aa1db9bd549d4211
make[1]: *** [docker-run] Error 1
make[1]: Leaving directory `/var/tmp/patchew-tester-tmp-jwaagcle/src'
make: *** [docker-run-test-debug@fedora] Error 2

real    27m51.270s
user    0m8.555s


The full log is available at
http://patchew.org/logs/cover.1583867210.git.balaton@eik.bme.hu/testing.asan/?type=message.
---
Email generated automatically by Patchew [https://patchew.org/].
Please send your feedback to patchew-devel@redhat.com