[libosmocore,0.9.6.48-3419] testsuite: 28 failed

Submitted by Martin Hauke on Jan. 7, 2017, 9:39 p.m.

Details

Message ID 0b9f095b-31c8-93c8-16f4-3f3c35a359a4@gmx.de
State New
Headers show

Commit Message

Martin Hauke Jan. 7, 2017, 9:39 p.m.
--------------------------------------------------------------------
 28: stats                              FAILED (testsuite.at:177)
--------------------------------------------------------------------

os: openSUSE Tumbleweed
arch: armv7l
compiler: gcc (SUSE Linux) 6.2.1 20161209 [gcc-6-branch revision 243481]
configure options: default

I have attached testsuite.log

best regards,
Martin
## ------------------------------------- ##
## libosmocore 0.9.6.48-3419 test suite. ##
## ------------------------------------- ##

testsuite: command line was:
  $ ./testsuite 

## --------- ##
## Platform. ##
## --------- ##

hostname = loki
uname -m = armv7l
uname -r = 4.4.36-8-default
uname -s = Linux
uname -v = #1 SMP Fri Dec 9 16:18:38 UTC 2016 (3ec5648)

/usr/bin/uname -p = armv7l
/bin/uname -X     = unknown

/bin/arch              = armv7l
/usr/bin/arch -k       = unknown
/usr/convex/getsysinfo = unknown
/usr/bin/hostinfo      = unknown
/bin/machine           = unknown
/usr/bin/oslevel       = unknown
/bin/universe          = unknown

PATH: /usr/local/src/libosmocore/tests
PATH: /sbin
PATH: /usr/sbin
PATH: /usr/local/sbin
PATH: /root/bin
PATH: /usr/local/bin
PATH: /usr/bin
PATH: /bin
PATH: /usr/games

testsuite: atconfig:
| # Configurable variable values for building test suites.
| # Generated by ./config.status.
| # Copyright (C) 2012 Free Software Foundation, Inc.
| 
| # The test suite will define top_srcdir=/../.. etc.
| at_testdir='tests'
| abs_builddir='/usr/local/src/libosmocore/tests'
| at_srcdir='.'
| abs_srcdir='/usr/local/src/libosmocore/tests'
| at_top_srcdir='..'
| abs_top_srcdir='/usr/local/src/libosmocore'
| at_top_build_prefix='../'
| abs_top_builddir='/usr/local/src/libosmocore'
| 
| # Backward compatibility with Autotest <= 2.59b:
| at_top_builddir=$at_top_build_prefix
| 
| AUTOTEST_PATH='tests'
| 
| SHELL=${CONFIG_SHELL-'/bin/sh'}

testsuite: atlocal:
| enable_sim_test='yes'

## ---------------- ##
## Tested programs. ##
## ---------------- ##

## ------------------ ##
## Running the tests. ##
## ------------------ ##
testsuite: starting at: Sat Jan  7 22:15:51 CET 2017
1. a5 (testsuite.at:6): ok     (0m0.198s 0m0.029s)
2. kasumi (testsuite.at:12): ok     (0m0.224s 0m0.007s)
3. bits (testsuite.at:18): ok     (0m0.206s 0m0.030s)
4. bitvec (testsuite.at:24): ok     (0m0.230s 0m0.015s)
5. bitcomp (testsuite.at:30): ok     (0m0.235s 0m0.002s)
6. conv (testsuite.at:36): ok     (0m0.206s 0m0.032s)
7. msgb (testsuite.at:42): ok     (0m0.239s 0m0.006s)
8. gea (testsuite.at:48): ok     (0m0.248s 0m0.000s)
9. msgfile (testsuite.at:55): ok     (0m0.210s 0m0.038s)
10. sms (testsuite.at:63): ok     (0m0.225s 0m0.030s)
11. smscb (testsuite.at:69): ok     (0m0.208s 0m0.014s)
12. ussd (testsuite.at:75): ok     (0m0.273s 0m0.014s)
13. auth (testsuite.at:81): ok     (0m0.204s 0m0.041s)
14. comp128 (testsuite.at:87): ok     (0m0.278s 0m0.016s)
15. lapd (testsuite.at:93): ok     (0m0.231s 0m0.021s)
16. gsm0808 (testsuite.at:99): ok     (0m0.235s 0m0.010s)
17. gsm0408 (testsuite.at:105): ok     (0m0.233s 0m0.020s)
18. gprs (testsuite.at:111): ok     (0m0.202s 0m0.044s)
19. logging (testsuite.at:117): ok     (0m0.217s 0m0.040s)
20. codec (testsuite.at:124): ok     (0m0.220s 0m0.018s)
21. fr (testsuite.at:130): ok     (0m0.235s 0m0.035s)
22. loggingrb (testsuite.at:137): ok     (0m0.232s 0m0.028s)
23. strrb (testsuite.at:144): ok     (0m0.225s 0m0.020s)
24. vty (testsuite.at:150): ok     (0m0.256s 0m0.035s)
25. gprs-bssgp (testsuite.at:156): ok     (0m0.216s 0m0.028s)
26. gprs-ns (testsuite.at:162): ok     (0m0.279s 0m0.022s)
27. utils (testsuite.at:168): ok     (0m0.239s 0m0.041s)
29. write_queue (testsuite.at:180): ok     (0m0.225s 0m0.016s)
30. bssgp-fc (testsuite.at:186): ok     (0m1.120s 0m0.136s)
31. sim (testsuite.at:193): ok     (0m0.266s 0m0.025s)
32. timer (testsuite.at:200): ok     (0m0.215s 0m0.027s)
33. tlv (testsuite.at:206): ok     (0m0.386s 0m0.016s)
34. gsup (testsuite.at:212): ok     (0m0.506s 0m0.019s)
35. fsm (testsuite.at:218): ok     (0m0.256s 0m0.022s)
36. oap (testsuite.at:225): ok     (0m0.239s 0m0.030s)
testsuite: ending at: Sat Jan  7 22:16:12 CET 2017
testsuite: test suite duration: 0h 0m 21s

## ------------- ##
## Test results. ##
## ------------- ##

ERROR: All 36 tests were run,
1 failed unexpectedly.

## ------------------------ ##
## Summary of the failures. ##
## ------------------------ ##
Failed tests:
libosmocore 0.9.6.48-3419 test suite test groups:

 NUM: FILE-NAME:LINE     TEST-GROUP-NAME
      KEYWORDS

  28: testsuite.at:174   stats
      stats

## ---------------------- ##
## Detailed failed tests. ##
## ---------------------- ##

#                             -*- compilation -*-
28. testsuite.at:174: testing stats ...
./testsuite.at:177: $abs_top_builddir/tests/stats/stats_test
stderr:
28. testsuite.at:174: 28. stats (testsuite.at:174): FAILED (testsuite.at:177)


## ------------- ##
## ../config.log ##
## ------------- ##
| This file contains any messages produced by compilers while
| running configure, to aid debugging if configure makes a mistake.
| 
| It was created by libosmocore configure 0.9.6.48-3419, which was
| generated by GNU Autoconf 2.69.  Invocation command line was
| 
|   $ configure 
| 
| ## --------- ##
| ## Platform. ##
| ## --------- ##
| 
| hostname = loki
| uname -m = armv7l
| uname -r = 4.4.36-8-default
| uname -s = Linux
| uname -v = #1 SMP Fri Dec 9 16:18:38 UTC 2016 (3ec5648)
| 
| /usr/bin/uname -p = armv7l
| /bin/uname -X     = unknown
| 
| /bin/arch              = armv7l
| /usr/bin/arch -k       = unknown
| /usr/convex/getsysinfo = unknown
| /usr/bin/hostinfo      = unknown
| /bin/machine           = unknown
| /usr/bin/oslevel       = unknown
| /bin/universe          = unknown
| 
| PATH: /sbin
| PATH: /usr/sbin
| PATH: /usr/local/sbin
| PATH: /root/bin
| PATH: /usr/local/bin
| PATH: /usr/bin
| PATH: /bin
| PATH: /usr/bin/X11
| PATH: /usr/games
| 
| 
| ## ----------- ##
| ## Core tests. ##
| ## ----------- ##
| 
| configure:2387: checking for a BSD-compatible install
| configure:2455: result: /usr/bin/install -c
| configure:2466: checking whether build environment is sane
| configure:2521: result: yes
| configure:2672: checking for a thread-safe mkdir -p
| configure:2711: result: /usr/bin/mkdir -p
| configure:2718: checking for gawk
| configure:2734: found /usr/bin/gawk
| configure:2745: result: gawk
| configure:2756: checking whether make sets $(MAKE)
| configure:2782: result: no
| configure:2807: checking whether make supports nested variables
| configure:2824: result: no
| configure:2964: checking whether make supports nested variables
| configure:2981: result: no
| configure:2993: checking whether make sets $(MAKE)
| configure:3019: result: no
| configure:3073: checking for gcc
| configure:3089: found /usr/bin/gcc
| configure:3100: result: gcc
| configure:3329: checking for C compiler version
| configure:3338: gcc --version >&5
| gcc (SUSE Linux) 6.2.1 20161209 [gcc-6-branch revision 243481]
| Copyright (C) 2016 Free Software Foundation, Inc.
| This is free software; see the source for copying conditions.  There is NO
| warranty; not even for MERCHANTABILITY or FITNESS FOR A PARTICULAR PURPOSE.
| 
| configure:3349: $? = 0
| configure:3338: gcc -v >&5
| Using built-in specs.
| COLLECT_GCC=gcc
| COLLECT_LTO_WRAPPER=/usr/lib/gcc/armv7hl-suse-linux-gnueabi/6/lto-wrapper
| Target: armv7hl-suse-linux-gnueabi
| Configured with: ../configure --prefix=/usr --infodir=/usr/share/info --mandir=/usr/share/man --libdir=/usr/lib --libexecdir=/usr/lib --enable-languages=c,c++,objc,fortran,obj-c++,java,go --enable-checking=release --with-gxx-include-dir=/usr/include/c++/6 --enable-ssp --disable-libssp --disable-libvtv --disable-libmpx --disable-libcc1 --enable-plugin --with-bugurl=http://bugs.opensuse.org/ --with-pkgversion='SUSE Linux' --disable-libgcj --with-slibdir=/lib --with-system-zlib --enable-__cxa_atexit --enable-libstdcxx-allocator=new --disable-libstdcxx-pch --enable-version-specific-runtime-libs --enable-linker-build-id --enable-linux-futex --enable-gnu-indirect-function --program-suffix=-6 --without-system-libunwind --with-arch=armv7-a --with-tune=cortex-a15 --with-float=hard --with-abi=aapcs-linux --with-fpu=vfpv3-d16 --disable-sjlj-exceptions --build=armv7hl-suse-linux-gnueabi --host=armv7hl-suse-linux-gnueabi
| Thread model: posix
| gcc version 6.2.1 20161209 [gcc-6-branch revision 243481] (SUSE Linux) 
| configure:3349: $? = 0
| configure:3338: gcc -V >&5
| gcc: error: unrecognized command line option '-V'
| gcc: fatal error: no input files
| compilation terminated.
| configure:3349: $? = 1
| configure:3338: gcc -qversion >&5
| gcc: error: unrecognized command line option '-qversion'; did you mean '--version'?
| gcc: fatal error: no input files
| compilation terminated.
| configure:3349: $? = 1
| configure:3369: checking whether the C compiler works
| configure:3391: gcc    conftest.c  >&5
| configure:3395: $? = 0
| configure:3443: result: yes
| configure:3446: checking for C compiler default output file name
| configure:3448: result: a.out
| configure:3454: checking for suffix of executables
| configure:3461: gcc -o conftest    conftest.c  >&5
| configure:3465: $? = 0
| configure:3487: result: 
| configure:3509: checking whether we are cross compiling
| configure:3517: gcc -o conftest    conftest.c  >&5
| configure:3521: $? = 0
| configure:3528: ./conftest
| configure:3532: $? = 0
| configure:3547: result: no
| configure:3552: checking for suffix of object files
| configure:3574: gcc -c   conftest.c >&5
| configure:3578: $? = 0
| configure:3599: result: o
| configure:3603: checking whether we are using the GNU C compiler
| configure:3622: gcc -c   conftest.c >&5
| configure:3622: $? = 0
| configure:3631: result: yes
| configure:3640: checking whether gcc accepts -g
| configure:3660: gcc -c -g  conftest.c >&5
| configure:3660: $? = 0
| configure:3701: result: yes
| configure:3718: checking for gcc option to accept ISO C89
| configure:3781: gcc  -c -g -O2  conftest.c >&5
| configure:3781: $? = 0
| configure:3794: result: none needed
| configure:3819: checking whether gcc understands -c and -o together
| configure:3841: gcc -c conftest.c -o conftest2.o
| configure:3844: $? = 0
| configure:3841: gcc -c conftest.c -o conftest2.o
| configure:3844: $? = 0
| configure:3856: result: yes
| configure:3884: checking for style of include used by make
| configure:3912: result: none
| configure:3938: checking dependency style of gcc
| configure:4049: result: none
| configure:4094: checking build system type
| configure:4108: result: armv7l-unknown-linux-gnueabihf
| configure:4128: checking host system type
| configure:4141: result: armv7l-unknown-linux-gnueabihf
| configure:4182: checking how to print strings
| configure:4209: result: printf
| configure:4230: checking for a sed that does not truncate output
| configure:4294: result: /usr/bin/sed
| configure:4312: checking for grep that handles long lines and -e
| configure:4370: result: /usr/bin/grep
| configure:4375: checking for egrep
| configure:4437: result: /usr/bin/grep -E
| configure:4442: checking for fgrep
| configure:4504: result: /usr/bin/grep -F
| configure:4539: checking for ld used by gcc
| configure:4606: result: /usr/armv7hl-suse-linux-gnueabi/bin/ld
| configure:4613: checking if the linker (/usr/armv7hl-suse-linux-gnueabi/bin/ld) is GNU ld
| configure:4628: result: yes
| configure:4640: checking for BSD- or MS-compatible name lister (nm)
| configure:4694: result: /usr/bin/nm -B
| configure:4824: checking the name lister (/usr/bin/nm -B) interface
| configure:4831: gcc -c -g -O2  conftest.c >&5
| configure:4834: /usr/bin/nm -B "conftest.o"
| configure:4837: output
| 00000000 B some_variable
| configure:4844: result: BSD nm
| configure:4847: checking whether ln -s works
| configure:4851: result: yes
| configure:4859: checking the maximum length of command line arguments
| configure:4990: result: 1572864
| configure:5038: checking how to convert armv7l-unknown-linux-gnueabihf file names to armv7l-unknown-linux-gnueabihf format
| configure:5078: result: func_convert_file_noop
| configure:5085: checking how to convert armv7l-unknown-linux-gnueabihf file names to toolchain format
| configure:5105: result: func_convert_file_noop
| configure:5112: checking for /usr/armv7hl-suse-linux-gnueabi/bin/ld option to reload object files
| configure:5119: result: -r
| configure:5193: checking for objdump
| configure:5209: found /usr/bin/objdump
| configure:5220: result: objdump
| configure:5252: checking how to recognize dependent libraries
| configure:5452: result: pass_all
| configure:5537: checking for dlltool
| configure:5567: result: no
| configure:5597: checking how to associate runtime and link libraries
| configure:5624: result: printf %s\n
| configure:5685: checking for ar
| configure:5701: found /usr/bin/ar
| configure:5712: result: ar
| configure:5749: checking for archiver @FILE support
| configure:5766: gcc -c -g -O2  conftest.c >&5
| configure:5766: $? = 0
| configure:5769: ar cru libconftest.a @conftest.lst >&5
| configure:5772: $? = 0
| configure:5777: ar cru libconftest.a @conftest.lst >&5
| ar: conftest.o: No such file or directory
| configure:5780: $? = 1
| configure:5792: result: @
| configure:5850: checking for strip
| configure:5866: found /usr/bin/strip
| configure:5877: result: strip
| configure:5949: checking for ranlib
| configure:5965: found /usr/bin/ranlib
| configure:5976: result: ranlib
| configure:6078: checking command to parse /usr/bin/nm -B output from gcc object
| configure:6231: gcc -c -g -O2  conftest.c >&5
| configure:6234: $? = 0
| configure:6238: /usr/bin/nm -B conftest.o \| sed -n -e 's/^.*[ ]\([ABCDGIRSTW][ABCDGIRSTW]*\)[ ][ ]*\([_A-Za-z][_A-Za-z0-9]*\)$/\1 \2 \2/p' | sed '/ __gnu_lto/d' \> conftest.nm
| configure:6241: $? = 0
| configure:6307: gcc -o conftest -g -O2   conftest.c conftstm.o >&5
| configure:6310: $? = 0
| configure:6348: result: ok
| configure:6395: checking for sysroot
| configure:6425: result: no
| configure:6432: checking for a working dd
| configure:6470: result: /usr/bin/dd
| configure:6474: checking how to truncate binary pipes
| configure:6489: result: /usr/bin/dd bs=4096 count=1
| configure:6818: checking for mt
| configure:6848: result: no
| configure:6868: checking if : is a manifest tool
| configure:6874: : '-?'
| configure:6882: result: no
| configure:7559: checking how to run the C preprocessor
| configure:7590: gcc -E  conftest.c
| configure:7590: $? = 0
| configure:7604: gcc -E  conftest.c
| conftest.c:11:28: fatal error: ac_nonexistent.h: No such file or directory
|  #include <ac_nonexistent.h>
|                             ^
| compilation terminated.
| configure:7604: $? = 1
| configure: failed program was:
| | /* confdefs.h */
| | #define PACKAGE_NAME "libosmocore"
| | #define PACKAGE_TARNAME "libosmocore"
| | #define PACKAGE_VERSION "0.9.6.48-3419"
| | #define PACKAGE_STRING "libosmocore 0.9.6.48-3419"
| | #define PACKAGE_BUGREPORT "openbsc@lists.osmocom.org"
| | #define PACKAGE_URL ""
| | #define PACKAGE "libosmocore"
| | #define VERSION "0.9.6.48-3419"
| | /* end confdefs.h.  */
| | #include <ac_nonexistent.h>
| configure:7629: result: gcc -E
| configure:7649: gcc -E  conftest.c
| configure:7649: $? = 0
| configure:7663: gcc -E  conftest.c
| conftest.c:11:28: fatal error: ac_nonexistent.h: No such file or directory
|  #include <ac_nonexistent.h>
|                             ^
| compilation terminated.
| configure:7663: $? = 1
| configure: failed program was:
| | /* confdefs.h */
| | #define PACKAGE_NAME "libosmocore"
| | #define PACKAGE_TARNAME "libosmocore"
| | #define PACKAGE_VERSION "0.9.6.48-3419"
| | #define PACKAGE_STRING "libosmocore 0.9.6.48-3419"
| | #define PACKAGE_BUGREPORT "openbsc@lists.osmocom.org"
| | #define PACKAGE_URL ""
| | #define PACKAGE "libosmocore"
| | #define VERSION "0.9.6.48-3419"
| | /* end confdefs.h.  */
| | #include <ac_nonexistent.h>
| configure:7692: checking for ANSI C header files
| configure:7712: gcc -c -g -O2  conftest.c >&5
| configure:7712: $? = 0
| configure:7785: gcc -o conftest -g -O2   conftest.c  >&5
| configure:7785: $? = 0
| configure:7785: ./conftest
| configure:7785: $? = 0
| configure:7796: result: yes
| configure:7809: checking for sys/types.h
| configure:7809: gcc -c -g -O2  conftest.c >&5
| configure:7809: $? = 0
| configure:7809: result: yes
| configure:7809: checking for sys/stat.h
| configure:7809: gcc -c -g -O2  conftest.c >&5
| configure:7809: $? = 0
| configure:7809: result: yes
| configure:7809: checking for stdlib.h
| configure:7809: gcc -c -g -O2  conftest.c >&5
| configure:7809: $? = 0
| configure:7809: result: yes
| configure:7809: checking for string.h
| configure:7809: gcc -c -g -O2  conftest.c >&5
| configure:7809: $? = 0
| configure:7809: result: yes
| configure:7809: checking for memory.h
| configure:7809: gcc -c -g -O2  conftest.c >&5
| configure:7809: $? = 0
| configure:7809: result: yes
| configure:7809: checking for strings.h
| configure:7809: gcc -c -g -O2  conftest.c >&5
| configure:7809: $? = 0
| configure:7809: result: yes
| configure:7809: checking for inttypes.h
| configure:7809: gcc -c -g -O2  conftest.c >&5
| configure:7809: $? = 0
| configure:7809: result: yes
| configure:7809: checking for stdint.h
| configure:7809: gcc -c -g -O2  conftest.c >&5
| configure:7809: $? = 0
| configure:7809: result: yes
| configure:7809: checking for unistd.h
| configure:7809: gcc -c -g -O2  conftest.c >&5
| configure:7809: $? = 0
| configure:7809: result: yes
| configure:7823: checking for dlfcn.h
| configure:7823: gcc -c -g -O2  conftest.c >&5
| configure:7823: $? = 0
| configure:7823: result: yes
| configure:8077: checking for objdir
| configure:8092: result: .libs
| configure:8356: checking if gcc supports -fno-rtti -fno-exceptions
| configure:8374: gcc -c -g -O2  -fno-rtti -fno-exceptions conftest.c >&5
| cc1: warning: command line option '-fno-rtti' is valid for C++/ObjC++ but not for C
| configure:8378: $? = 0
| configure:8391: result: no
| configure:8749: checking for gcc option to produce PIC
| configure:8756: result: -fPIC -DPIC
| configure:8764: checking if gcc PIC flag -fPIC -DPIC works
| configure:8782: gcc -c -g -O2  -fPIC -DPIC -DPIC conftest.c >&5
| configure:8786: $? = 0
| configure:8799: result: yes
| configure:8828: checking if gcc static flag -static works
| configure:8856: result: no
| configure:8871: checking if gcc supports -c -o file.o
| configure:8892: gcc -c -g -O2  -o out/conftest2.o conftest.c >&5
| configure:8896: $? = 0
| configure:8918: result: yes
| configure:8926: checking if gcc supports -c -o file.o
| configure:8973: result: yes
| configure:9006: checking whether the gcc linker (/usr/armv7hl-suse-linux-gnueabi/bin/ld) supports shared libraries
| configure:10265: result: yes
| configure:10302: checking whether -lc should be explicitly linked in
| configure:10310: gcc -c -g -O2  conftest.c >&5
| configure:10313: $? = 0
| configure:10328: gcc -shared  -fPIC -DPIC conftest.o  -v -Wl,-soname -Wl,conftest -o conftest 2\>\&1 \| /usr/bin/grep  -lc  \>/dev/null 2\>\&1
| configure:10331: $? = 0
| configure:10345: result: no
| configure:10505: checking dynamic linker characteristics
| configure:11086: gcc -o conftest -g -O2   -Wl,-rpath -Wl,/foo conftest.c  >&5
| configure:11086: $? = 0
| configure:11323: result: GNU/Linux ld.so
| configure:11445: checking how to hardcode library paths into programs
| configure:11470: result: immediate
| configure:12018: checking whether stripping libraries is possible
| configure:12023: result: yes
| configure:12058: checking if libtool supports shared libraries
| configure:12060: result: yes
| configure:12063: checking whether to build shared libraries
| configure:12088: result: yes
| configure:12091: checking whether to build static libraries
| configure:12095: result: no
| configure:12137: checking for pkg-config
| configure:12155: found /usr/bin/pkg-config
| configure:12168: result: /usr/bin/pkg-config
| configure:12234: checking for pkg-config
| configure:12252: found /usr/bin/pkg-config
| configure:12264: result: /usr/bin/pkg-config
| configure:12289: checking pkg-config is at least version 0.20
| configure:12292: result: yes
| configure:12312: checking for ANSI C header files
| configure:12416: result: yes
| configure:12427: checking execinfo.h usability
| configure:12427: gcc -c -g -O2  conftest.c >&5
| configure:12427: $? = 0
| configure:12427: result: yes
| configure:12427: checking execinfo.h presence
| configure:12427: gcc -E  conftest.c
| configure:12427: $? = 0
| configure:12427: result: yes
| configure:12427: checking for execinfo.h
| configure:12427: result: yes
| configure:12427: checking sys/select.h usability
| configure:12427: gcc -c -g -O2  conftest.c >&5
| configure:12427: $? = 0
| configure:12427: result: yes
| configure:12427: checking sys/select.h presence
| configure:12427: gcc -E  conftest.c
| configure:12427: $? = 0
| configure:12427: result: yes
| configure:12427: checking for sys/select.h
| configure:12427: result: yes
| configure:12427: checking sys/socket.h usability
| configure:12427: gcc -c -g -O2  conftest.c >&5
| configure:12427: $? = 0
| configure:12427: result: yes
| configure:12427: checking sys/socket.h presence
| configure:12427: gcc -E  conftest.c
| configure:12427: $? = 0
| configure:12427: result: yes
| configure:12427: checking for sys/socket.h
| configure:12427: result: yes
| configure:12427: checking syslog.h usability
| configure:12427: gcc -c -g -O2  conftest.c >&5
| configure:12427: $? = 0
| configure:12427: result: yes
| configure:12427: checking syslog.h presence
| configure:12427: gcc -E  conftest.c
| configure:12427: $? = 0
| configure:12427: result: yes
| configure:12427: checking for syslog.h
| configure:12427: result: yes
| configure:12427: checking ctype.h usability
| configure:12427: gcc -c -g -O2  conftest.c >&5
| configure:12427: $? = 0
| configure:12427: result: yes
| configure:12427: checking ctype.h presence
| configure:12427: gcc -E  conftest.c
| configure:12427: $? = 0
| configure:12427: result: yes
| configure:12427: checking for ctype.h
| configure:12427: result: yes
| configure:12427: checking netinet/tcp.h usability
| configure:12427: gcc -c -g -O2  conftest.c >&5
| configure:12427: $? = 0
| configure:12427: result: yes
| configure:12427: checking netinet/tcp.h presence
| configure:12427: gcc -E  conftest.c
| configure:12427: $? = 0
| configure:12427: result: yes
| configure:12427: checking for netinet/tcp.h
| configure:12427: result: yes
| configure:12438: checking for size_t
| configure:12438: gcc -c -g -O2  conftest.c >&5
| configure:12438: $? = 0
| configure:12438: gcc -c -g -O2  conftest.c >&5
| conftest.c: In function 'main':
| conftest.c:66:21: error: expected expression before ')' token
|  if (sizeof ((size_t)))
|                      ^
| configure:12438: $? = 1
| configure: failed program was:
| | /* confdefs.h */
| | #define PACKAGE_NAME "libosmocore"
| | #define PACKAGE_TARNAME "libosmocore"
| | #define PACKAGE_VERSION "0.9.6.48-3419"
| | #define PACKAGE_STRING "libosmocore 0.9.6.48-3419"
| | #define PACKAGE_BUGREPORT "openbsc@lists.osmocom.org"
| | #define PACKAGE_URL ""
| | #define PACKAGE "libosmocore"
| | #define VERSION "0.9.6.48-3419"
| | #define STDC_HEADERS 1
| | #define HAVE_SYS_TYPES_H 1
| | #define HAVE_SYS_STAT_H 1
| | #define HAVE_STDLIB_H 1
| | #define HAVE_STRING_H 1
| | #define HAVE_MEMORY_H 1
| | #define HAVE_STRINGS_H 1
| | #define HAVE_INTTYPES_H 1
| | #define HAVE_STDINT_H 1
| | #define HAVE_UNISTD_H 1
| | #define HAVE_DLFCN_H 1
| | #define LT_OBJDIR ".libs/"
| | #define STDC_HEADERS 1
| | #define HAVE_EXECINFO_H 1
| | #define HAVE_SYS_SELECT_H 1
| | #define HAVE_SYS_SOCKET_H 1
| | #define HAVE_SYSLOG_H 1
| | #define HAVE_CTYPE_H 1
| | #define HAVE_NETINET_TCP_H 1
| | /* end confdefs.h.  */
| | #include <stdio.h>
| | #ifdef HAVE_SYS_TYPES_H
| | # include <sys/types.h>
| | #endif
| | #ifdef HAVE_SYS_STAT_H
| | # include <sys/stat.h>
| | #endif
| | #ifdef STDC_HEADERS
| | # include <stdlib.h>
| | # include <stddef.h>
| | #else
| | # ifdef HAVE_STDLIB_H
| | #  include <stdlib.h>
| | # endif
| | #endif
| | #ifdef HAVE_STRING_H
| | # if !defined STDC_HEADERS && defined HAVE_MEMORY_H
| | #  include <memory.h>
| | # endif
| | # include <string.h>
| | #endif
| | #ifdef HAVE_STRINGS_H
| | # include <strings.h>
| | #endif
| | #ifdef HAVE_INTTYPES_H
| | # include <inttypes.h>
| | #endif
| | #ifdef HAVE_STDINT_H
| | # include <stdint.h>
| | #endif
| | #ifdef HAVE_UNISTD_H
| | # include <unistd.h>
| | #endif
| | int
| | main ()
| | {
| | if (sizeof ((size_t)))
| | 	    return 0;
| |   ;
| |   return 0;
| | }
| configure:12438: result: yes
| configure:12451: checking for working alloca.h
| configure:12468: gcc -o conftest -g -O2   conftest.c  >&5
| configure:12468: $? = 0
| configure:12476: result: yes
| configure:12484: checking for alloca
| configure:12521: gcc -o conftest -g -O2   conftest.c  >&5
| configure:12521: $? = 0
| configure:12529: result: yes
| configure:12635: checking for library containing dlopen
| configure:12666: gcc -o conftest -g -O2   conftest.c  >&5
| /tmp/cc2HehrS.o: In function `main':
| /usr/local/src/libosmocore/conftest.c:43: undefined reference to `dlopen'
| collect2: error: ld returned 1 exit status
| configure:12666: $? = 1
| configure: failed program was:
| | /* confdefs.h */
| | #define PACKAGE_NAME "libosmocore"
| | #define PACKAGE_TARNAME "libosmocore"
| | #define PACKAGE_VERSION "0.9.6.48-3419"
| | #define PACKAGE_STRING "libosmocore 0.9.6.48-3419"
| | #define PACKAGE_BUGREPORT "openbsc@lists.osmocom.org"
| | #define PACKAGE_URL ""
| | #define PACKAGE "libosmocore"
| | #define VERSION "0.9.6.48-3419"
| | #define STDC_HEADERS 1
| | #define HAVE_SYS_TYPES_H 1
| | #define HAVE_SYS_STAT_H 1
| | #define HAVE_STDLIB_H 1
| | #define HAVE_STRING_H 1
| | #define HAVE_MEMORY_H 1
| | #define HAVE_STRINGS_H 1
| | #define HAVE_INTTYPES_H 1
| | #define HAVE_STDINT_H 1
| | #define HAVE_UNISTD_H 1
| | #define HAVE_DLFCN_H 1
| | #define LT_OBJDIR ".libs/"
| | #define STDC_HEADERS 1
| | #define HAVE_EXECINFO_H 1
| | #define HAVE_SYS_SELECT_H 1
| | #define HAVE_SYS_SOCKET_H 1
| | #define HAVE_SYSLOG_H 1
| | #define HAVE_CTYPE_H 1
| | #define HAVE_NETINET_TCP_H 1
| | #define HAVE_ALLOCA_H 1
| | #define HAVE_ALLOCA 1
| | /* end confdefs.h.  */
| | 
| | /* Override any GCC internal prototype to avoid an error.
| |    Use char because int might match the return type of a GCC
| |    builtin and then its argument prototype would still apply.  */
| | #ifdef __cplusplus
| | extern "C"
| | #endif
| | char dlopen ();
| | int
| | main ()
| | {
| | return dlopen ();
| |   ;
| |   return 0;
| | }
| configure:12666: gcc -o conftest -g -O2   conftest.c -ldl   >&5
| configure:12666: $? = 0
| configure:12683: result: -ldl
| configure:12693: checking for backtrace in -lexecinfo
| configure:12718: gcc -o conftest -g -O2   conftest.c -lexecinfo   >&5
| /usr/lib/gcc/armv7hl-suse-linux-gnueabi/6/../../../../armv7hl-suse-linux-gnueabi/bin/ld: cannot find -lexecinfo
| collect2: error: ld returned 1 exit status
| configure:12718: $? = 1
| configure: failed program was:
| | /* confdefs.h */
| | #define PACKAGE_NAME "libosmocore"
| | #define PACKAGE_TARNAME "libosmocore"
| | #define PACKAGE_VERSION "0.9.6.48-3419"
| | #define PACKAGE_STRING "libosmocore 0.9.6.48-3419"
| | #define PACKAGE_BUGREPORT "openbsc@lists.osmocom.org"
| | #define PACKAGE_URL ""
| | #define PACKAGE "libosmocore"
| | #define VERSION "0.9.6.48-3419"
| | #define STDC_HEADERS 1
| | #define HAVE_SYS_TYPES_H 1
| | #define HAVE_SYS_STAT_H 1
| | #define HAVE_STDLIB_H 1
| | #define HAVE_STRING_H 1
| | #define HAVE_MEMORY_H 1
| | #define HAVE_STRINGS_H 1
| | #define HAVE_INTTYPES_H 1
| | #define HAVE_STDINT_H 1
| | #define HAVE_UNISTD_H 1
| | #define HAVE_DLFCN_H 1
| | #define LT_OBJDIR ".libs/"
| | #define STDC_HEADERS 1
| | #define HAVE_EXECINFO_H 1
| | #define HAVE_SYS_SELECT_H 1
| | #define HAVE_SYS_SOCKET_H 1
| | #define HAVE_SYSLOG_H 1
| | #define HAVE_CTYPE_H 1
| | #define HAVE_NETINET_TCP_H 1
| | #define HAVE_ALLOCA_H 1
| | #define HAVE_ALLOCA 1
| | /* end confdefs.h.  */
| | 
| | /* Override any GCC internal prototype to avoid an error.
| |    Use char because int might match the return type of a GCC
| |    builtin and then its argument prototype would still apply.  */
| | #ifdef __cplusplus
| | extern "C"
| | #endif
| | char backtrace ();
| | int
| | main ()
| | {
| | return backtrace ();
| |   ;
| |   return 0;
| | }
| configure:12727: result: no
| configure:12739: checking for doxygen
| configure:12770: result: false
| configure:12790: checking if gcc supports -fvisibility=hidden
| configure:12796: gcc -c -g -O2 -fvisibility=hidden   conftest.c >&5
| configure:12796: $? = 0
| configure:12797: result: yes
| configure:12811: checking whether struct tm has tm_gmtoff member
| configure:12835: gcc -o conftest -g -O2   conftest.c  >&5
| configure:12835: $? = 0
| configure:12845: result: yes
| configure:12859: checking for TALLOC
| configure:12866: $PKG_CONFIG --exists --print-errors "talloc >= 2.0.1"
| configure:12869: $? = 0
| configure:12883: $PKG_CONFIG --exists --print-errors "talloc >= 2.0.1"
| configure:12886: $? = 0
| configure:12944: result: yes
| configure:12964: checking for PCSC
| configure:12971: $PKG_CONFIG --exists --print-errors "libpcsclite"
| configure:12974: $? = 0
| configure:12988: $PKG_CONFIG --exists --print-errors "libpcsclite"
| configure:12991: $? = 0
| configure:13049: result: yes
| configure:13378: checking that generated files are newer than configure
| configure:13384: result: done
| configure:13463: creating ./config.status
| 
| ## ---------------------- ##
| ## Running config.status. ##
| ## ---------------------- ##
| 
| This file was extended by libosmocore config.status 0.9.6.48-3419, which was
| generated by GNU Autoconf 2.69.  Invocation command line was
| 
|   CONFIG_FILES    = 
|   CONFIG_HEADERS  = 
|   CONFIG_LINKS    = 
|   CONFIG_COMMANDS = 
|   $ ./config.status 
| 
| on loki
| 
| config.status:1150: creating libosmocore.pc
| config.status:1150: creating libosmocodec.pc
| config.status:1150: creating libosmovty.pc
| config.status:1150: creating libosmogsm.pc
| config.status:1150: creating libosmogb.pc
| config.status:1150: creating libosmoctrl.pc
| config.status:1150: creating libosmosim.pc
| config.status:1150: creating include/Makefile
| config.status:1150: creating src/Makefile
| config.status:1150: creating src/vty/Makefile
| config.status:1150: creating src/codec/Makefile
| config.status:1150: creating src/sim/Makefile
| config.status:1150: creating src/gsm/Makefile
| config.status:1150: creating src/gb/Makefile
| config.status:1150: creating src/ctrl/Makefile
| config.status:1150: creating tests/Makefile
| config.status:1150: creating tests/atlocal
| config.status:1150: creating utils/Makefile
| config.status:1150: creating Doxyfile.core
| config.status:1150: creating Doxyfile.gsm
| config.status:1150: creating Doxyfile.vty
| config.status:1150: creating Doxyfile.codec
| config.status:1150: creating Makefile
| config.status:1150: creating config.h
| config.status:1379: executing tests/atconfig commands
| config.status:1379: executing depfiles commands
| config.status:1379: executing libtool commands
| 
| ## ---------------- ##
| ## Cache variables. ##
| ## ---------------- ##
| 
| ac_cv_build=armv7l-unknown-linux-gnueabihf
| ac_cv_c_compiler_gnu=yes
| ac_cv_env_CC_set=
| ac_cv_env_CC_value=
| ac_cv_env_CFLAGS_set=
| ac_cv_env_CFLAGS_value=
| ac_cv_env_CPPFLAGS_set=
| ac_cv_env_CPPFLAGS_value=
| ac_cv_env_CPP_set=
| ac_cv_env_CPP_value=
| ac_cv_env_LDFLAGS_set=
| ac_cv_env_LDFLAGS_value=
| ac_cv_env_LIBS_set=
| ac_cv_env_LIBS_value=
| ac_cv_env_LT_SYS_LIBRARY_PATH_set=
| ac_cv_env_LT_SYS_LIBRARY_PATH_value=
| ac_cv_env_PCSC_CFLAGS_set=
| ac_cv_env_PCSC_CFLAGS_value=
| ac_cv_env_PCSC_LIBS_set=
| ac_cv_env_PCSC_LIBS_value=
| ac_cv_env_PKG_CONFIG_LIBDIR_set=
| ac_cv_env_PKG_CONFIG_LIBDIR_value=
| ac_cv_env_PKG_CONFIG_PATH_set=
| ac_cv_env_PKG_CONFIG_PATH_value=
| ac_cv_env_PKG_CONFIG_set=
| ac_cv_env_PKG_CONFIG_value=
| ac_cv_env_TALLOC_CFLAGS_set=
| ac_cv_env_TALLOC_CFLAGS_value=
| ac_cv_env_TALLOC_LIBS_set=
| ac_cv_env_TALLOC_LIBS_value=
| ac_cv_env_build_alias_set=
| ac_cv_env_build_alias_value=
| ac_cv_env_host_alias_set=
| ac_cv_env_host_alias_value=
| ac_cv_env_target_alias_set=
| ac_cv_env_target_alias_value=
| ac_cv_func_alloca_works=yes
| ac_cv_header_ctype_h=yes
| ac_cv_header_dlfcn_h=yes
| ac_cv_header_execinfo_h=yes
| ac_cv_header_inttypes_h=yes
| ac_cv_header_memory_h=yes
| ac_cv_header_netinet_tcp_h=yes
| ac_cv_header_stdc=yes
| ac_cv_header_stdint_h=yes
| ac_cv_header_stdlib_h=yes
| ac_cv_header_string_h=yes
| ac_cv_header_strings_h=yes
| ac_cv_header_sys_select_h=yes
| ac_cv_header_sys_socket_h=yes
| ac_cv_header_sys_stat_h=yes
| ac_cv_header_sys_types_h=yes
| ac_cv_header_syslog_h=yes
| ac_cv_header_unistd_h=yes
| ac_cv_host=armv7l-unknown-linux-gnueabihf
| ac_cv_lib_execinfo_backtrace=no
| ac_cv_objext=o
| ac_cv_path_DOXYGEN=false
| ac_cv_path_EGREP='/usr/bin/grep -E'
| ac_cv_path_FGREP='/usr/bin/grep -F'
| ac_cv_path_GREP=/usr/bin/grep
| ac_cv_path_PKG_CONFIG_INSTALLED=/usr/bin/pkg-config
| ac_cv_path_SED=/usr/bin/sed
| ac_cv_path_ac_pt_PKG_CONFIG=/usr/bin/pkg-config
| ac_cv_path_install='/usr/bin/install -c'
| ac_cv_path_lt_DD=/usr/bin/dd
| ac_cv_path_mkdir=/usr/bin/mkdir
| ac_cv_prog_AWK=gawk
| ac_cv_prog_CPP='gcc -E'
| ac_cv_prog_ac_ct_AR=ar
| ac_cv_prog_ac_ct_CC=gcc
| ac_cv_prog_ac_ct_OBJDUMP=objdump
| ac_cv_prog_ac_ct_RANLIB=ranlib
| ac_cv_prog_ac_ct_STRIP=strip
| ac_cv_prog_cc_c89=
| ac_cv_prog_cc_g=yes
| ac_cv_prog_make_make_set=no
| ac_cv_search_dlopen=-ldl
| ac_cv_type_size_t=yes
| ac_cv_working_alloca_h=yes
| am_cv_CC_dependencies_compiler_type=none
| am_cv_make_support_nested_variables=no
| am_cv_prog_cc_c_o=yes
| lt_cv_ar_at_file=@
| lt_cv_archive_cmds_need_lc=no
| lt_cv_deplibs_check_method=pass_all
| lt_cv_file_magic_cmd='$MAGIC_CMD'
| lt_cv_file_magic_test_file=
| lt_cv_ld_reload_flag=-r
| lt_cv_nm_interface='BSD nm'
| lt_cv_objdir=.libs
| lt_cv_path_LD=/usr/armv7hl-suse-linux-gnueabi/bin/ld
| lt_cv_path_NM='/usr/bin/nm -B'
| lt_cv_path_mainfest_tool=no
| lt_cv_prog_compiler_c_o=yes
| lt_cv_prog_compiler_pic='-fPIC -DPIC'
| lt_cv_prog_compiler_pic_works=yes
| lt_cv_prog_compiler_rtti_exceptions=no
| lt_cv_prog_compiler_static_works=no
| lt_cv_prog_gnu_ld=yes
| lt_cv_sharedlib_from_linklib_cmd='printf %s\n'
| lt_cv_shlibpath_overrides_runpath=yes
| lt_cv_sys_global_symbol_pipe='sed -n -e '\''s/^.*[	 ]\([ABCDGIRSTW][ABCDGIRSTW]*\)[	 ][	 ]*\([_A-Za-z][_A-Za-z0-9]*\)$/\1 \2 \2/p'\'' | sed '\''/ __gnu_lto/d'\'''
| lt_cv_sys_global_symbol_to_c_name_address='sed -n -e '\''s/^: \(.*\) .*$/  {"\1", (void *) 0},/p'\'' -e '\''s/^[ABCDGIRSTW][ABCDGIRSTW]* .* \(.*\)$/  {"\1", (void *) \&\1},/p'\'''
| lt_cv_sys_global_symbol_to_c_name_address_lib_prefix='sed -n -e '\''s/^: \(.*\) .*$/  {"\1", (void *) 0},/p'\'' -e '\''s/^[ABCDGIRSTW][ABCDGIRSTW]* .* \(lib.*\)$/  {"\1", (void *) \&\1},/p'\'' -e '\''s/^[ABCDGIRSTW][ABCDGIRSTW]* .* \(.*\)$/  {"lib\1", (void *) \&\1},/p'\'''
| lt_cv_sys_global_symbol_to_cdecl='sed -n -e '\''s/^T .* \(.*\)$/extern int \1();/p'\'' -e '\''s/^[ABCDGIRSTW][ABCDGIRSTW]* .* \(.*\)$/extern char \1;/p'\'''
| lt_cv_sys_global_symbol_to_import=
| lt_cv_sys_max_cmd_len=1572864
| lt_cv_to_host_file_cmd=func_convert_file_noop
| lt_cv_to_tool_file_cmd=func_convert_file_noop
| lt_cv_truncate_bin='/usr/bin/dd bs=4096 count=1'
| osmo_cv_tm_includes_tm_gmtoff=yes
| pkg_cv_PCSC_CFLAGS='-pthread -I/usr/include/PCSC'
| pkg_cv_PCSC_LIBS=-lpcsclite
| pkg_cv_TALLOC_CFLAGS=
| pkg_cv_TALLOC_LIBS=-ltalloc
| 
| ## ----------------- ##
| ## Output variables. ##
| ## ----------------- ##
| 
| ACLOCAL='${SHELL} /usr/local/src/libosmocore/missing aclocal-1.15'
| ALLOCA=''
| AMDEPBACKSLASH='\'
| AMDEP_FALSE='#'
| AMDEP_TRUE=''
| AMTAR='$${TAR-tar}'
| AM_BACKSLASH='\'
| AM_DEFAULT_V='0'
| AM_DEFAULT_VERBOSITY='0'
| AM_V='0'
| AR='ar'
| AUTOCONF='${SHELL} /usr/local/src/libosmocore/missing autoconf'
| AUTOHEADER='${SHELL} /usr/local/src/libosmocore/missing autoheader'
| AUTOMAKE='${SHELL} /usr/local/src/libosmocore/missing automake-1.15'
| AWK='gawk'
| BACKTRACE_LIB=''
| CC='gcc'
| CCDEPMODE='depmode=none'
| CFLAGS='-g -O2'
| CPP='gcc -E'
| CPPFLAGS=''
| CYGPATH_W='echo'
| DEFS='-DHAVE_CONFIG_H'
| DEPDIR='.deps'
| DLLTOOL='false'
| DOXYGEN='false'
| DSYMUTIL=''
| DUMPBIN=''
| ECHO_C=''
| ECHO_N='-n'
| ECHO_T=''
| EGREP='/usr/bin/grep -E'
| ENABLE_GB_FALSE='#'
| ENABLE_GB_TRUE=''
| ENABLE_MSGFILE_FALSE='#'
| ENABLE_MSGFILE_TRUE=''
| ENABLE_PCSC='yes'
| ENABLE_PCSC_FALSE='#'
| ENABLE_PCSC_TRUE=''
| ENABLE_PLUGIN_FALSE='#'
| ENABLE_PLUGIN_TRUE=''
| ENABLE_SERIAL_FALSE='#'
| ENABLE_SERIAL_TRUE=''
| ENABLE_UTILITIES_FALSE='#'
| ENABLE_UTILITIES_TRUE=''
| ENABLE_VTY_FALSE='#'
| ENABLE_VTY_TRUE=''
| EXEEXT=''
| FGREP='/usr/bin/grep -F'
| GREP='/usr/bin/grep'
| HAVE_DOXYGEN_FALSE=''
| HAVE_DOXYGEN_TRUE='#'
| INSTALL_DATA='${INSTALL} -m 644'
| INSTALL_PROGRAM='${INSTALL}'
| INSTALL_SCRIPT='${INSTALL}'
| INSTALL_STRIP_PROGRAM='$(install_sh) -c -s'
| LD='/usr/armv7hl-suse-linux-gnueabi/bin/ld'
| LDFLAGS=''
| LIBOBJS=''
| LIBRARY_DL='-ldl '
| LIBS=''
| LIBTOOL='$(SHELL) $(top_builddir)/libtool'
| LIPO=''
| LN_S='ln -s'
| LTLDFLAGS_OSMOGB='-Wl,--version-script=$(srcdir)/libosmogb.map'
| LTLDFLAGS_OSMOGSM='-Wl,--version-script=$(srcdir)/libosmogsm.map'
| LTLIBOBJS=''
| LT_SYS_LIBRARY_PATH=''
| MAKEINFO='${SHELL} /usr/local/src/libosmocore/missing makeinfo'
| MANIFEST_TOOL=':'
| MKDIR_P='/usr/bin/mkdir -p'
| NM='/usr/bin/nm -B'
| NMEDIT=''
| OBJDUMP='objdump'
| OBJEXT='o'
| OTOOL64=''
| OTOOL=''
| PACKAGE='libosmocore'
| PACKAGE_BUGREPORT='openbsc@lists.osmocom.org'
| PACKAGE_NAME='libosmocore'
| PACKAGE_STRING='libosmocore 0.9.6.48-3419'
| PACKAGE_TARNAME='libosmocore'
| PACKAGE_URL=''
| PACKAGE_VERSION='0.9.6.48-3419'
| PATH_SEPARATOR=':'
| PCSC_CFLAGS='-pthread -I/usr/include/PCSC'
| PCSC_LIBS='-lpcsclite'
| PKG_CONFIG='/usr/bin/pkg-config'
| PKG_CONFIG_INSTALLED='/usr/bin/pkg-config'
| PKG_CONFIG_LIBDIR=''
| PKG_CONFIG_PATH=''
| RANLIB='ranlib'
| SED='/usr/bin/sed'
| SET_MAKE='MAKE=make'
| SHELL='/bin/sh'
| STRIP='strip'
| SYMBOL_VISIBILITY='-fvisibility=hidden'
| TALLOC_CFLAGS=''
| TALLOC_LIBS='-ltalloc'
| VERSION='0.9.6.48-3419'
| ac_ct_AR='ar'
| ac_ct_CC='gcc'
| ac_ct_DUMPBIN=''
| am__EXEEXT_FALSE=''
| am__EXEEXT_TRUE='#'
| am__fastdepCC_FALSE=''
| am__fastdepCC_TRUE='#'
| am__include='#'
| am__isrc=''
| am__leading_dot='.'
| am__nodep='_no'
| am__quote=''
| am__tar='$${TAR-tar} chof - "$$tardir"'
| am__untar='$${TAR-tar} xf -'
| bindir='${exec_prefix}/bin'
| build='armv7l-unknown-linux-gnueabihf'
| build_alias=''
| build_cpu='armv7l'
| build_os='linux-gnueabihf'
| build_vendor='unknown'
| datadir='${datarootdir}'
| datarootdir='${prefix}/share'
| docdir='${datarootdir}/doc/${PACKAGE_TARNAME}'
| dvidir='${docdir}'
| exec_prefix='${prefix}'
| host='armv7l-unknown-linux-gnueabihf'
| host_alias=''
| host_cpu='armv7l'
| host_os='linux-gnueabihf'
| host_vendor='unknown'
| htmldir='${docdir}'
| includedir='${prefix}/include'
| infodir='${datarootdir}/info'
| install_sh='${SHELL} /usr/local/src/libosmocore/install-sh'
| libdir='${exec_prefix}/lib'
| libexecdir='${exec_prefix}/libexec'
| localedir='${datarootdir}/locale'
| localstatedir='${prefix}/var'
| mandir='${datarootdir}/man'
| mkdir_p='$(MKDIR_P)'
| oldincludedir='/usr/include'
| pdfdir='${docdir}'
| prefix='/usr/local'
| program_transform_name='s,x,x,'
| psdir='${docdir}'
| sbindir='${exec_prefix}/sbin'
| sharedstatedir='${prefix}/com'
| sysconfdir='${prefix}/etc'
| target_alias=''
| 
| ## ----------- ##
| ## confdefs.h. ##
| ## ----------- ##
| 
| /* confdefs.h */
| #define PACKAGE_NAME "libosmocore"
| #define PACKAGE_TARNAME "libosmocore"
| #define PACKAGE_VERSION "0.9.6.48-3419"
| #define PACKAGE_STRING "libosmocore 0.9.6.48-3419"
| #define PACKAGE_BUGREPORT "openbsc@lists.osmocom.org"
| #define PACKAGE_URL ""
| #define PACKAGE "libosmocore"
| #define VERSION "0.9.6.48-3419"
| #define STDC_HEADERS 1
| #define HAVE_SYS_TYPES_H 1
| #define HAVE_SYS_STAT_H 1
| #define HAVE_STDLIB_H 1
| #define HAVE_STRING_H 1
| #define HAVE_MEMORY_H 1
| #define HAVE_STRINGS_H 1
| #define HAVE_INTTYPES_H 1
| #define HAVE_STDINT_H 1
| #define HAVE_UNISTD_H 1
| #define HAVE_DLFCN_H 1
| #define LT_OBJDIR ".libs/"
| #define STDC_HEADERS 1
| #define HAVE_EXECINFO_H 1
| #define HAVE_SYS_SELECT_H 1
| #define HAVE_SYS_SOCKET_H 1
| #define HAVE_SYSLOG_H 1
| #define HAVE_CTYPE_H 1
| #define HAVE_NETINET_TCP_H 1
| #define HAVE_ALLOCA_H 1
| #define HAVE_ALLOCA 1
| #define HAVE_TM_GMTOFF_IN_TM 1
| #define BSC_FD_CHECK 1
| 
| configure: exit 0

Patch hide | download patch | download mbox

--- expout	2017-01-07 22:16:03.000000000 +0100
+++ /usr/local/src/libosmocore/tests/testsuite.dir/at-groups/28/stdout	2017-01-07 22:16:04.000000000 +0100
@@ -10,36 +10,36 @@ 
   test1: counter p= g=ctr-test.one i=1 n=ctr.a v=0 d=0
   test2: counter p= g=ctr-test.one i=1 n=ctr.b v=0 d=0
   test1: counter p= g=ctr-test.one i=1 n=ctr.b v=0 d=0
-  test2: item p= g=test.one i=2 n=item.a v=-1 u=ma
-  test1: item p= g=test.one i=2 n=item.a v=-1 u=ma
-  test2: item p= g=test.one i=2 n=item.b v=-1 u=kb
-  test1: item p= g=test.one i=2 n=item.b v=-1 u=kb
-  test2: item p= g=test.one i=1 n=item.a v=-1 u=ma
-  test1: item p= g=test.one i=1 n=item.a v=-1 u=ma
-  test2: item p= g=test.one i=1 n=item.b v=-1 u=kb
-  test1: item p= g=test.one i=1 n=item.b v=-1 u=kb
+  test2: item p= g=test.one i=2 n=item.a v=74324 u=ma
+  test1: item p= g=test.one i=2 n=item.a v=74324 u=ma
+  test2: item p= g=test.one i=2 n=item.b v=74324 u=kb
+  test1: item p= g=test.one i=2 n=item.b v=74324 u=kb
+  test2: item p= g=test.one i=1 n=item.a v=74324 u=ma
+  test1: item p= g=test.one i=1 n=item.a v=74324 u=ma
+  test2: item p= g=test.one i=1 n=item.b v=74324 u=kb
+  test1: item p= g=test.one i=1 n=item.b v=74324 u=kb
 report (srep1 global):
   test2: counter p= g=ctr-test.one i=2 n=ctr.a v=0 d=0
   test2: counter p= g=ctr-test.one i=2 n=ctr.b v=0 d=0
   test2: counter p= g=ctr-test.one i=1 n=ctr.a v=0 d=0
   test2: counter p= g=ctr-test.one i=1 n=ctr.b v=0 d=0
-  test2: item p= g=test.one i=2 n=item.a v=-1 u=ma
-  test2: item p= g=test.one i=2 n=item.b v=-1 u=kb
-  test2: item p= g=test.one i=1 n=item.a v=-1 u=ma
-  test2: item p= g=test.one i=1 n=item.b v=-1 u=kb
+  test2: item p= g=test.one i=2 n=item.a v=74324 u=ma
+  test2: item p= g=test.one i=2 n=item.b v=74324 u=kb
+  test2: item p= g=test.one i=1 n=item.a v=74324 u=ma
+  test2: item p= g=test.one i=1 n=item.b v=74324 u=kb
 report (srep1 peer):
   test2: counter p= g=ctr-test.one i=2 n=ctr.a v=0 d=0
   test2: counter p= g=ctr-test.one i=2 n=ctr.b v=0 d=0
   test2: counter p= g=ctr-test.one i=1 n=ctr.a v=0 d=0
   test2: counter p= g=ctr-test.one i=1 n=ctr.b v=0 d=0
-  test2: item p= g=test.one i=2 n=item.a v=-1 u=ma
-  test1: item p= g=test.one i=2 n=item.a v=-1 u=ma
-  test2: item p= g=test.one i=2 n=item.b v=-1 u=kb
-  test1: item p= g=test.one i=2 n=item.b v=-1 u=kb
-  test2: item p= g=test.one i=1 n=item.a v=-1 u=ma
-  test1: item p= g=test.one i=1 n=item.a v=-1 u=ma
-  test2: item p= g=test.one i=1 n=item.b v=-1 u=kb
-  test1: item p= g=test.one i=1 n=item.b v=-1 u=kb
+  test2: item p= g=test.one i=2 n=item.a v=74324 u=ma
+  test1: item p= g=test.one i=2 n=item.a v=74324 u=ma
+  test2: item p= g=test.one i=2 n=item.b v=74324 u=kb
+  test1: item p= g=test.one i=2 n=item.b v=74324 u=kb
+  test2: item p= g=test.one i=1 n=item.a v=74324 u=ma
+  test1: item p= g=test.one i=1 n=item.a v=74324 u=ma
+  test2: item p= g=test.one i=1 n=item.b v=74324 u=kb
+  test1: item p= g=test.one i=1 n=item.b v=74324 u=kb
 report (srep1 subscriber):
   test2: counter p= g=ctr-test.one i=2 n=ctr.a v=0 d=0
   test1: counter p= g=ctr-test.one i=2 n=ctr.a v=0 d=0
@@ -49,56 +49,56 @@ 
   test1: counter p= g=ctr-test.one i=1 n=ctr.a v=0 d=0
   test2: counter p= g=ctr-test.one i=1 n=ctr.b v=0 d=0
   test1: counter p= g=ctr-test.one i=1 n=ctr.b v=0 d=0
-  test2: item p= g=test.one i=2 n=item.a v=-1 u=ma
-  test1: item p= g=test.one i=2 n=item.a v=-1 u=ma
-  test2: item p= g=test.one i=2 n=item.b v=-1 u=kb
-  test1: item p= g=test.one i=2 n=item.b v=-1 u=kb
-  test2: item p= g=test.one i=1 n=item.a v=-1 u=ma
-  test1: item p= g=test.one i=1 n=item.a v=-1 u=ma
-  test2: item p= g=test.one i=1 n=item.b v=-1 u=kb
-  test1: item p= g=test.one i=1 n=item.b v=-1 u=kb
+  test2: item p= g=test.one i=2 n=item.a v=74324 u=ma
+  test1: item p= g=test.one i=2 n=item.a v=74324 u=ma
+  test2: item p= g=test.one i=2 n=item.b v=74324 u=kb
+  test1: item p= g=test.one i=2 n=item.b v=74324 u=kb
+  test2: item p= g=test.one i=1 n=item.a v=74324 u=ma
+  test1: item p= g=test.one i=1 n=item.a v=74324 u=ma
+  test2: item p= g=test.one i=1 n=item.b v=74324 u=kb
+  test1: item p= g=test.one i=1 n=item.b v=74324 u=kb
 report (srep2 disabled):
   test2: close
   test1: counter p= g=ctr-test.one i=2 n=ctr.a v=0 d=0
   test1: counter p= g=ctr-test.one i=2 n=ctr.b v=0 d=0
   test1: counter p= g=ctr-test.one i=1 n=ctr.a v=0 d=0
   test1: counter p= g=ctr-test.one i=1 n=ctr.b v=0 d=0
-  test1: item p= g=test.one i=2 n=item.a v=-1 u=ma
-  test1: item p= g=test.one i=2 n=item.b v=-1 u=kb
-  test1: item p= g=test.one i=1 n=item.a v=-1 u=ma
-  test1: item p= g=test.one i=1 n=item.b v=-1 u=kb
+  test1: item p= g=test.one i=2 n=item.a v=74324 u=ma
+  test1: item p= g=test.one i=2 n=item.b v=74324 u=kb
+  test1: item p= g=test.one i=1 n=item.a v=74324 u=ma
+  test1: item p= g=test.one i=1 n=item.b v=74324 u=kb
 report (srep2 enabled, no flush forced):
   test2: open
   test2: counter p= g=ctr-test.one i=2 n=ctr.a v=0 d=0
   test2: counter p= g=ctr-test.one i=2 n=ctr.b v=0 d=0
   test2: counter p= g=ctr-test.one i=1 n=ctr.a v=0 d=0
   test2: counter p= g=ctr-test.one i=1 n=ctr.b v=0 d=0
-  test2: item p= g=test.one i=2 n=item.a v=-1 u=ma
-  test2: item p= g=test.one i=2 n=item.b v=-1 u=kb
-  test2: item p= g=test.one i=1 n=item.a v=-1 u=ma
-  test2: item p= g=test.one i=1 n=item.b v=-1 u=kb
+  test2: item p= g=test.one i=2 n=item.a v=74324 u=ma
+  test2: item p= g=test.one i=2 n=item.b v=74324 u=kb
+  test2: item p= g=test.one i=1 n=item.a v=74324 u=ma
+  test2: item p= g=test.one i=1 n=item.b v=74324 u=kb
 report (should be empty):
 report (group 1, counter 1 update):
   test2: counter p= g=ctr-test.one i=1 n=ctr.a v=1 d=1
   test1: counter p= g=ctr-test.one i=1 n=ctr.a v=1 d=1
 report (group 1, item 1 update):
-  test2: item p= g=test.one i=1 n=item.a v=10 u=ma
-  test1: item p= g=test.one i=1 n=item.a v=10 u=ma
+  test2: item p= g=test.one i=1 n=item.a v=74324 u=ma
+  test1: item p= g=test.one i=1 n=item.a v=74324 u=ma
 report (remove statg1, ctrg1):
   test2: counter p= g=ctr-test.one i=2 n=ctr.a v=0 d=0
   test1: counter p= g=ctr-test.one i=2 n=ctr.a v=0 d=0
   test2: counter p= g=ctr-test.one i=2 n=ctr.b v=0 d=0
   test1: counter p= g=ctr-test.one i=2 n=ctr.b v=0 d=0
-  test2: item p= g=test.one i=2 n=item.a v=-1 u=ma
-  test1: item p= g=test.one i=2 n=item.a v=-1 u=ma
-  test2: item p= g=test.one i=2 n=item.b v=-1 u=kb
-  test1: item p= g=test.one i=2 n=item.b v=-1 u=kb
+  test2: item p= g=test.one i=2 n=item.a v=74324 u=ma
+  test1: item p= g=test.one i=2 n=item.a v=74324 u=ma
+  test2: item p= g=test.one i=2 n=item.b v=74324 u=kb
+  test1: item p= g=test.one i=2 n=item.b v=74324 u=kb
 report (remove srep1):
   test1: close
   test2: counter p= g=ctr-test.one i=2 n=ctr.a v=0 d=0
   test2: counter p= g=ctr-test.one i=2 n=ctr.b v=0 d=0
-  test2: item p= g=test.one i=2 n=item.a v=-1 u=ma
-  test2: item p= g=test.one i=2 n=item.b v=-1 u=kb
+  test2: item p= g=test.one i=2 n=item.a v=74324 u=ma
+  test2: item p= g=test.one i=2 n=item.b v=74324 u=kb
 report (remove statg2):
   test2: counter p= g=ctr-test.one i=2 n=ctr.a v=0 d=0
   test2: counter p= g=ctr-test.one i=2 n=ctr.b v=0 d=0