[PULL,v5,00/43] Machine and x86 queue, 2019-07-03
mbox

Message ID 20190703210821.27550-1-ehabkost@redhat.com
State New
Headers show

Pull-request

git://github.com/ehabkost/qemu.git tags/machine-next-pull-request

Message

Eduardo Habkost July 3, 2019, 9:07 p.m. UTC
Changes v4 -> v5:
* Rebase and solve conflicts with commit 374f63f6810a ("Merge remote-tracking
  branch 'remotes/armbru/tags/pull-monitor-2019-07-02-v2' into staging")

Changes v3 -> v4:
* Fix ppc64 "make check" failure

Changes v2 -> v3:
* Fix "make check" warnings (Igor Mammedov)
* Fix conflicts of "hw/arm: Replace global smp variables with
  machine smp properties" with recent arm changes (Eduardo Habkost)
* x86 versioned CPU models (Eduardo Habkost)
* SnowRidge CPU model (Paul Lai)
* Add deprecation information to query-machines (Eduardo Habkost)

Changes v1 -> v2:
* Fix s390x build failure


The following changes since commit 374f63f6810a2f99254cdf32af67035d951301c8:

  Merge remote-tracking branch 'remotes/armbru/tags/pull-monitor-2019-07-02-v2' into staging (2019-07-03 00:16:43 +0100)

are available in the Git repository at:

  git://github.com/ehabkost/qemu.git tags/machine-next-pull-request

for you to fetch changes up to adae41278c7e3472b1f4f0228c37dbcfd95fa6a5:

  tests: use -numa memdev option in tests instead of legacy 'mem' option (2019-07-03 15:41:29 -0300)

----------------------------------------------------------------
Machine and x86 queue, 2019-07-03

* CPU die topology support (Like Xu)
* Deprecation of features (Igor Mammedov):
  * 'mem' parameter of '-numa node' option
  * implict memory distribution between NUMA nodes
  * deprecate -mem-path fallback to anonymous RAM
* x86 versioned CPU models (Eduardo Habkost)
* SnowRidge CPU model (Paul Lai)
* Add deprecation information to query-machines (Eduardo Habkost)
* Other i386 fixes

----------------------------------------------------------------

Queue for Machine Core patches


Alex Bennée (1):
  target/i386: fix feature check in hyperv-stub.c

Eduardo Habkost (15):
  hppa: Delete unused hppa_cpu_list() function
  i386: Don't print warning if phys-bits was set automatically
  i386: Fix signedness of hyperv_spinlock_attempts
  i386: Remove unused host_cpudef variable
  qmp: Add deprecation information to query-machines
  qmp: Add "alias-of" field to query-cpu-definitions
  i386: Add x-force-features option for testing
  i386: Get model-id from CPU object on "-cpu help"
  i386: Register versioned CPU models
  i386: Define -IBRS, -noTSX, -IBRS versions of CPU models
  i386: Replace -noTSX, -IBRS, -IBPB CPU models with aliases
  i386: Make unversioned CPU models be aliases
  docs: Deprecate CPU model runnability guarantees
  i386: Add Cascadelake-Server-v2 CPU model
  numa: Make deprecation warnings conditional on !qtest_enabled()

Igor Mammedov (7):
  pc: fix possible NULL pointer dereference in
    pc_machine_get_device_memory_region_size()
  machine: show if CLI option '-numa node,mem' is supported in QAPI
    schema
  numa: deprecate 'mem' parameter of '-numa node' option
  numa: deprecate implict memory distribution between nodes
  deprecate -mem-path fallback to anonymous RAM
  numa: allow memory-less nodes when using memdev as backend
  tests: use -numa memdev option in tests instead of legacy 'mem' option

Like Xu (17):
  hw/boards: Add struct CpuTopology to MachineState
  machine: Refactor smp-related call chains to pass MachineState
  general: Replace global smp variables with smp machine properties
  hw/ppc: Replace global smp variables with machine smp properties
  hw/riscv: Replace global smp variables with machine smp properties
  hw/s390x: Replace global smp variables with machine smp properties
  hw/i386: Replace global smp variables with machine smp properties
  hw/arm: Replace global smp variables with machine smp properties
  hw: Replace global smp variables with MachineState for all remaining
    archs
  vl.c: Replace smp global variables with smp machine properties
  i386: Add die-level cpu topology to x86CPU on PCMachine
  hw/i386: Adjust nr_dies with configured smp_dies for PCMachine
  i386/cpu: Consolidate die-id validity in smp context
  i386: Update new x86_apicid parsing rules with die_offset support
  target/i386: Add CPUID.1F generation support for multi-dies PCMachine
  machine: Refactor smp_parse() in vl.c as MachineClass::smp_parse()
  vl.c: Add -smp, dies=* command line support and update doc

Paul Lai (1):
  i386: Introduce SnowRidge CPU model

Roman Kagan (1):
  i386: make 'hv-spinlocks' a regular uint32 property

Wei Yang (1):
  x86/cpu: use FeatureWordArray to define filtered_features

 qapi/machine-target.json                   |    9 +-
 qapi/machine.json                          |   17 +-
 include/hw/boards.h                        |   27 +-
 include/hw/firmware/smbios.h               |    5 +-
 include/hw/i386/pc.h                       |    8 +-
 include/hw/i386/topology.h                 |   76 +-
 target/hppa/cpu.h                          |    2 -
 target/i386/cpu-qom.h                      |   10 +-
 target/i386/cpu.h                          |   36 +-
 accel/kvm/kvm-all.c                        |    4 +-
 backends/hostmem.c                         |    6 +-
 cpus.c                                     |    7 +-
 exec.c                                     |    3 +-
 gdbstub.c                                  |    4 +
 hw/alpha/dp264.c                           |    1 +
 hw/arm/aspeed.c                            |    2 +-
 hw/arm/fsl-imx6.c                          |    6 +-
 hw/arm/fsl-imx6ul.c                        |    6 +-
 hw/arm/fsl-imx7.c                          |    7 +-
 hw/arm/highbank.c                          |    1 +
 hw/arm/mcimx6ul-evk.c                      |    2 +-
 hw/arm/mcimx7d-sabre.c                     |    2 +-
 hw/arm/raspi.c                             |    4 +-
 hw/arm/realview.c                          |    1 +
 hw/arm/sabrelite.c                         |    2 +-
 hw/arm/sbsa-ref.c                          |    4 +
 hw/arm/vexpress.c                          |   16 +-
 hw/arm/virt.c                              |   11 +-
 hw/arm/xlnx-zynqmp.c                       |   16 +-
 hw/core/machine-hmp-cmds.c                 |    3 +
 hw/core/machine-qmp-cmds.c                 |    4 +-
 hw/core/machine.c                          |   88 ++
 hw/core/numa.c                             |   36 +-
 hw/cpu/core.c                              |    4 +-
 hw/hppa/machine.c                          |    4 +-
 hw/i386/acpi-build.c                       |   13 +-
 hw/i386/kvmvapic.c                         |    7 +-
 hw/i386/pc.c                               |  186 +++-
 hw/i386/pc_piix.c                          |    4 +
 hw/i386/pc_q35.c                           |    4 +
 hw/i386/xen/xen-hvm.c                      |    4 +
 hw/mips/boston.c                           |    2 +-
 hw/mips/mips_malta.c                       |   24 +-
 hw/openrisc/openrisc_sim.c                 |    1 +
 hw/ppc/e500.c                              |    3 +
 hw/ppc/mac_newworld.c                      |    3 +-
 hw/ppc/mac_oldworld.c                      |    3 +-
 hw/ppc/pnv.c                               |    9 +-
 hw/ppc/prep.c                              |    4 +-
 hw/ppc/spapr.c                             |   38 +-
 hw/ppc/spapr_rtas.c                        |    4 +-
 hw/riscv/sifive_e.c                        |    6 +-
 hw/riscv/sifive_plic.c                     |    3 +
 hw/riscv/sifive_u.c                        |    6 +-
 hw/riscv/spike.c                           |    3 +
 hw/riscv/virt.c                            |    1 +
 hw/s390x/s390-virtio-ccw.c                 |    9 +-
 hw/s390x/sclp.c                            |    2 +-
 hw/smbios/smbios.c                         |   26 +-
 hw/sparc/sun4m.c                           |    2 +
 hw/sparc64/sun4u.c                         |    4 +-
 hw/xtensa/sim.c                            |    2 +-
 hw/xtensa/xtfpga.c                         |    1 +
 migration/postcopy-ram.c                   |    8 +-
 target/arm/cpu.c                           |    8 +-
 target/hppa/cpu.c                          |   17 -
 target/i386/cpu.c                          | 1171 ++++++++++----------
 target/i386/hyperv-stub.c                  |    2 +-
 target/i386/kvm.c                          |   12 +
 target/openrisc/sys_helper.c               |    6 +-
 target/s390x/cpu.c                         |    3 +
 target/s390x/excp_helper.c                 |    5 +
 target/s390x/kvm.c                         |   10 +-
 tcg/tcg.c                                  |   13 +-
 tests/bios-tables-test.c                   |   40 +-
 tests/test-x86-cpuid.c                     |   84 +-
 vl.c                                       |   96 +-
 qemu-deprecated.texi                       |   52 +
 qemu-options.hx                            |   17 +-
 tests/acceptance/x86_cpu_model_versions.py |  304 +++++
 80 files changed, 1704 insertions(+), 952 deletions(-)
 create mode 100644 tests/acceptance/x86_cpu_model_versions.py

Comments

no-reply@patchew.org July 4, 2019, 12:08 a.m. UTC | #1
Patchew URL: https://patchew.org/QEMU/20190703210821.27550-1-ehabkost@redhat.com/



Hi,

This series seems to have some coding style problems. See output below for
more information:

Type: series
Subject: [Qemu-devel] [PULL v5 00/43] Machine and x86 queue, 2019-07-03
Message-id: 20190703210821.27550-1-ehabkost@redhat.com

=== TEST SCRIPT BEGIN ===
#!/bin/bash
git rev-parse base > /dev/null || exit 0
git config --local diff.renamelimit 0
git config --local diff.renames True
git config --local diff.algorithm histogram
./scripts/checkpatch.pl --mailback base..
=== TEST SCRIPT END ===

From https://github.com/patchew-project/qemu
 * [new tag]         patchew/20190703210821.27550-1-ehabkost@redhat.com -> patchew/20190703210821.27550-1-ehabkost@redhat.com
Switched to a new branch 'test'
e26968f tests: use -numa memdev option in tests instead of legacy 'mem' option
447d6d4 numa: allow memory-less nodes when using memdev as backend
764f45e numa: Make deprecation warnings conditional on !qtest_enabled()
372daf9 i386: Add Cascadelake-Server-v2 CPU model
1f7eb57 docs: Deprecate CPU model runnability guarantees
4a0035e i386: Make unversioned CPU models be aliases
20900a7 i386: Replace -noTSX, -IBRS, -IBPB CPU models with aliases
166fe70 i386: Define -IBRS, -noTSX, -IBRS versions of CPU models
a89190a i386: Register versioned CPU models
56ffcb3 i386: Get model-id from CPU object on "-cpu help"
67e4979 i386: Add x-force-features option for testing
518bdad qmp: Add "alias-of" field to query-cpu-definitions
cd002fc i386: Introduce SnowRidge CPU model
e1310a8 qmp: Add deprecation information to query-machines
8d52c8a vl.c: Add -smp, dies=* command line support and update doc
c99c25e machine: Refactor smp_parse() in vl.c as MachineClass::smp_parse()
92c1d48 target/i386: Add CPUID.1F generation support for multi-dies PCMachine
2916d9c i386: Remove unused host_cpudef variable
772d2d1 x86/cpu: use FeatureWordArray to define filtered_features
3fd83d5 i386: make 'hv-spinlocks' a regular uint32 property
c890e36 i386: Fix signedness of hyperv_spinlock_attempts
2ee6343 i386: Don't print warning if phys-bits was set automatically
a79d3b1 deprecate -mem-path fallback to anonymous RAM
7adb2d0 target/i386: fix feature check in hyperv-stub.c
0b56873 hppa: Delete unused hppa_cpu_list() function
5be5f4b numa: deprecate implict memory distribution between nodes
83e35ab numa: deprecate 'mem' parameter of '-numa node' option
974440f machine: show if CLI option '-numa node, mem' is supported in QAPI schema
5de1395 pc: fix possible NULL pointer dereference in pc_machine_get_device_memory_region_size()
b40da5f i386: Update new x86_apicid parsing rules with die_offset support
fbbe2b7 i386/cpu: Consolidate die-id validity in smp context
f92d9f8 hw/i386: Adjust nr_dies with configured smp_dies for PCMachine
8373ee6 i386: Add die-level cpu topology to x86CPU on PCMachine
47e130a vl.c: Replace smp global variables with smp machine properties
78bcf8e hw: Replace global smp variables with MachineState for all remaining archs
d547c96 hw/arm: Replace global smp variables with machine smp properties
1e9d486 hw/i386: Replace global smp variables with machine smp properties
4c58559 hw/s390x: Replace global smp variables with machine smp properties
ba70985 hw/riscv: Replace global smp variables with machine smp properties
4a0ba9a hw/ppc: Replace global smp variables with machine smp properties
9ab64d0 general: Replace global smp variables with smp machine properties
266a798 machine: Refactor smp-related call chains to pass MachineState
cb578f9 hw/boards: Add struct CpuTopology to MachineState

=== OUTPUT BEGIN ===
1/43 Checking commit cb578f909d0c (hw/boards: Add struct CpuTopology to MachineState)
2/43 Checking commit 266a79866dda (machine: Refactor smp-related call chains to pass MachineState)
3/43 Checking commit 9ab64d0fb399 (general: Replace global smp variables with smp machine properties)
4/43 Checking commit 4a0ba9a730fd (hw/ppc: Replace global smp variables with machine smp properties)
5/43 Checking commit ba7098542206 (hw/riscv: Replace global smp variables with machine smp properties)
6/43 Checking commit 4c58559cf5fe (hw/s390x: Replace global smp variables with machine smp properties)
7/43 Checking commit 1e9d486608b0 (hw/i386: Replace global smp variables with machine smp properties)
8/43 Checking commit d547c9689615 (hw/arm: Replace global smp variables with machine smp properties)
9/43 Checking commit 78bcf8e082dc (hw: Replace global smp variables with MachineState for all remaining archs)
10/43 Checking commit 47e130a8a78f (vl.c: Replace smp global variables with smp machine properties)
11/43 Checking commit 8373ee61e3ec (i386: Add die-level cpu topology to x86CPU on PCMachine)
12/43 Checking commit f92d9f8b7ef9 (hw/i386: Adjust nr_dies with configured smp_dies for PCMachine)
13/43 Checking commit fbbe2b7e7095 (i386/cpu: Consolidate die-id validity in smp context)
14/43 Checking commit b40da5fdee3f (i386: Update new x86_apicid parsing rules with die_offset support)
15/43 Checking commit 5de139533a1b (pc: fix possible NULL pointer dereference in pc_machine_get_device_memory_region_size())
16/43 Checking commit 974440fdbd02 (machine: show if CLI option '-numa node, mem' is supported in QAPI schema)
17/43 Checking commit 83e35abe8ce4 (numa: deprecate 'mem' parameter of '-numa node' option)
18/43 Checking commit 5be5f4bf504c (numa: deprecate implict memory distribution between nodes)
19/43 Checking commit 0b5687394f83 (hppa: Delete unused hppa_cpu_list() function)
20/43 Checking commit 7adb2d0dacba (target/i386: fix feature check in hyperv-stub.c)
21/43 Checking commit a79d3b183e28 (deprecate -mem-path fallback to anonymous RAM)
22/43 Checking commit 2ee6343435c9 (i386: Don't print warning if phys-bits was set automatically)
23/43 Checking commit c890e364f986 (i386: Fix signedness of hyperv_spinlock_attempts)
24/43 Checking commit 3fd83d5832e9 (i386: make 'hv-spinlocks' a regular uint32 property)
25/43 Checking commit 772d2d161121 (x86/cpu: use FeatureWordArray to define filtered_features)
26/43 Checking commit 2916d9cbce4e (i386: Remove unused host_cpudef variable)
27/43 Checking commit 92c1d4878308 (target/i386: Add CPUID.1F generation support for multi-dies PCMachine)
28/43 Checking commit c99c25ebf4ec (machine: Refactor smp_parse() in vl.c as MachineClass::smp_parse())
29/43 Checking commit 8d52c8a67bd1 (vl.c: Add -smp, dies=* command line support and update doc)
30/43 Checking commit e1310a8f1488 (qmp: Add deprecation information to query-machines)
31/43 Checking commit cd002fc2be3f (i386: Introduce SnowRidge CPU model)
32/43 Checking commit 518bdad584b6 (qmp: Add "alias-of" field to query-cpu-definitions)
33/43 Checking commit 67e4979d802c (i386: Add x-force-features option for testing)
34/43 Checking commit 56ffcb3eaf9d (i386: Get model-id from CPU object on "-cpu help")
35/43 Checking commit a89190addf18 (i386: Register versioned CPU models)
WARNING: line over 80 characters
#100: FILE: target/i386/cpu.c:1482:
+static const X86CPUVersionDefinition *x86_cpu_def_get_versions(X86CPUDefinition *def)

WARNING: Block comments use a leading /* on a separate line
#105: FILE: target/i386/cpu.c:1487:
+        { /* end of list */ }

WARNING: Block comments use a leading /* on a separate line
#122: FILE: target/i386/cpu.c:1883:
+        .versions = (X86CPUVersionDefinition[]) { { /* end of list */ } },

WARNING: Block comments use a leading /* on a separate line
#134: FILE: target/i386/cpu.c:1942:
+        .versions = (X86CPUVersionDefinition[]) { { /* end of list */ } },

WARNING: Block comments use a leading /* on a separate line
#146: FILE: target/i386/cpu.c:2011:
+        .versions = (X86CPUVersionDefinition[]) { { /* end of list */ } },

WARNING: Block comments use a leading /* on a separate line
#158: FILE: target/i386/cpu.c:2086:
+        .versions = (X86CPUVersionDefinition[]) { { /* end of list */ } },

WARNING: Block comments use a leading /* on a separate line
#170: FILE: target/i386/cpu.c:2127:
+        .versions = (X86CPUVersionDefinition[]) { { /* end of list */ } },

WARNING: Block comments use a leading /* on a separate line
#182: FILE: target/i386/cpu.c:2170:
+        .versions = (X86CPUVersionDefinition[]) { { /* end of list */ } },

WARNING: Block comments use a leading /* on a separate line
#194: FILE: target/i386/cpu.c:2251:
+        .versions = (X86CPUVersionDefinition[]) { { /* end of list */ } },

WARNING: Block comments use a leading /* on a separate line
#206: FILE: target/i386/cpu.c:2294:
+        .versions = (X86CPUVersionDefinition[]) { { /* end of list */ } },

WARNING: Block comments use a leading /* on a separate line
#218: FILE: target/i386/cpu.c:2339:
+        .versions = (X86CPUVersionDefinition[]) { { /* end of list */ } },

WARNING: Block comments use a leading /* on a separate line
#230: FILE: target/i386/cpu.c:2422:
+        .versions = (X86CPUVersionDefinition[]) { { /* end of list */ } },

WARNING: Block comments use a leading /* on a separate line
#242: FILE: target/i386/cpu.c:2519:
+        .versions = (X86CPUVersionDefinition[]) { { /* end of list */ } },

WARNING: Block comments use a leading /* on a separate line
#254: FILE: target/i386/cpu.c:2626:
+        .versions = (X86CPUVersionDefinition[]) { { /* end of list */ } },

WARNING: Block comments use a leading /* on a separate line
#266: FILE: target/i386/cpu.c:3139:
+        .versions = (X86CPUVersionDefinition[]) { { /* end of list */ } },

WARNING: line over 80 characters
#333: FILE: target/i386/cpu.c:4117:
+    for (vdef = x86_cpu_def_get_versions(model->cpudef); vdef->version; vdef++) {

WARNING: added, moved or deleted file(s), does MAINTAINERS need updating?
#509: 
new file mode 100644

ERROR: line over 90 characters
#552: FILE: tests/acceptance/x86_cpu_model_versions.py:39:
+                              '%s.alias-of (%s) is not a valid CPU model name' % (c['name'], c['alias-of']))

ERROR: line over 90 characters
#555: FILE: tests/acceptance/x86_cpu_model_versions.py:42:
+                                 '%s.alias-of (%s) points to another alias' % (c['name'], c['alias-of']))

WARNING: line over 80 characters
#591: FILE: tests/acceptance/x86_cpu_model_versions.py:78:
+        """Check if pc-*-4.0 unversioned CPU model won't be reported as aliases"""

WARNING: line over 80 characters
#598: FILE: tests/acceptance/x86_cpu_model_versions.py:85:
+        cpus = dict((m['name'], m) for m in self.vm.command('query-cpu-definitions'))

WARNING: line over 80 characters
#601: FILE: tests/acceptance/x86_cpu_model_versions.py:88:
+                         'unversioned Cascadelake-Server CPU model must not be static')

total: 2 errors, 20 warnings, 550 lines checked

Patch 35/43 has style problems, please review.  If any of these errors
are false positives report them to the maintainer, see
CHECKPATCH in MAINTAINERS.

36/43 Checking commit 166fe709d0d7 (i386: Define -IBRS, -noTSX, -IBRS versions of CPU models)
WARNING: Block comments use a leading /* on a separate line
#36: FILE: target/i386/cpu.c:1863:
+                    { /* end of list */ }

WARNING: Block comments use a leading /* on a separate line
#39: FILE: target/i386/cpu.c:1866:
+            { /* end of list */ }

WARNING: Block comments use a leading /* on a separate line
#57: FILE: target/i386/cpu.c:1933:
+                    { /* end of list */ }

WARNING: Block comments use a leading /* on a separate line
#60: FILE: target/i386/cpu.c:1936:
+            { /* end of list */ }

WARNING: Block comments use a leading /* on a separate line
#78: FILE: target/i386/cpu.c:2011:
+                    { /* end of list */ }

WARNING: Block comments use a leading /* on a separate line
#81: FILE: target/i386/cpu.c:2014:
+            { /* end of list */ }

WARNING: Block comments use a leading /* on a separate line
#99: FILE: target/i386/cpu.c:2097:
+                    { /* end of list */ }

WARNING: Block comments use a leading /* on a separate line
#102: FILE: target/i386/cpu.c:2100:
+            { /* end of list */ }

WARNING: Block comments use a leading /* on a separate line
#121: FILE: target/i386/cpu.c:2274:
+                    { /* end of list */ }

WARNING: Block comments use a leading /* on a separate line
#139: FILE: target/i386/cpu.c:2292:
+                    { /* end of list */ }

WARNING: Block comments use a leading /* on a separate line
#152: FILE: target/i386/cpu.c:2305:
+                    { /* end of list */ }

WARNING: Block comments use a leading /* on a separate line
#155: FILE: target/i386/cpu.c:2308:
+            { /* end of list */ }

WARNING: Block comments use a leading /* on a separate line
#173: FILE: target/i386/cpu.c:2489:
+                    { /* end of list */ }

WARNING: Block comments use a leading /* on a separate line
#186: FILE: target/i386/cpu.c:2502:
+                    { /* end of list */ }

WARNING: Block comments use a leading /* on a separate line
#198: FILE: target/i386/cpu.c:2514:
+                    { /* end of list */ }

WARNING: Block comments use a leading /* on a separate line
#201: FILE: target/i386/cpu.c:2517:
+            { /* end of list */ }

WARNING: Block comments use a leading /* on a separate line
#219: FILE: target/i386/cpu.c:2618:
+                    { /* end of list */ }

WARNING: Block comments use a leading /* on a separate line
#222: FILE: target/i386/cpu.c:2621:
+            { /* end of list */ }

WARNING: Block comments use a leading /* on a separate line
#243: FILE: target/i386/cpu.c:2737:
+                    { /* end of list */ }

WARNING: Block comments use a leading /* on a separate line
#246: FILE: target/i386/cpu.c:2740:
+            { /* end of list */ }

WARNING: Block comments use a leading /* on a separate line
#264: FILE: target/i386/cpu.c:3266:
+                    { /* end of list */ }

WARNING: Block comments use a leading /* on a separate line
#267: FILE: target/i386/cpu.c:3269:
+            { /* end of list */ }

total: 0 errors, 22 warnings, 240 lines checked

Patch 36/43 has style problems, please review.  If any of these errors
are false positives report them to the maintainer, see
CHECKPATCH in MAINTAINERS.
37/43 Checking commit 20900a70ab4d (i386: Replace -noTSX, -IBRS, -IBPB CPU models with aliases)
38/43 Checking commit 4a0035ee1441 (i386: Make unversioned CPU models be aliases)
WARNING: line over 80 characters
#267: FILE: tests/acceptance/x86_cpu_model_versions.py:108:
+        """Check if unversioned CPU model is an alias pointing to right version"""

WARNING: line over 80 characters
#272: FILE: tests/acceptance/x86_cpu_model_versions.py:113:
+        cpus = dict((m['name'], m) for m in self.vm.command('query-cpu-definitions'))

WARNING: line over 80 characters
#275: FILE: tests/acceptance/x86_cpu_model_versions.py:116:
+                         'unversioned Cascadelake-Server CPU model must not be static')

ERROR: line over 90 characters
#276: FILE: tests/acceptance/x86_cpu_model_versions.py:117:
+        self.assertEquals(cpus['Cascadelake-Server'].get('alias-of'), 'Cascadelake-Server-v1',

WARNING: line over 80 characters
#277: FILE: tests/acceptance/x86_cpu_model_versions.py:118:
+                          'Cascadelake-Server must be an alias of Cascadelake-Server-v1')

WARNING: line over 80 characters
#369: FILE: tests/acceptance/x86_cpu_model_versions.py:210:
+        """Check if unversioned CPU model is an alias pointing to some version"""

WARNING: line over 80 characters
#374: FILE: tests/acceptance/x86_cpu_model_versions.py:215:
+        cpus = dict((m['name'], m) for m in self.vm.command('query-cpu-definitions'))

WARNING: line over 80 characters
#377: FILE: tests/acceptance/x86_cpu_model_versions.py:218:
+                         'unversioned Cascadelake-Server CPU model must not be static')

ERROR: line over 90 characters
#378: FILE: tests/acceptance/x86_cpu_model_versions.py:219:
+        self.assertTrue(re.match('Cascadelake-Server-v[0-9]+', cpus['Cascadelake-Server']['alias-of']),

WARNING: line over 80 characters
#379: FILE: tests/acceptance/x86_cpu_model_versions.py:220:
+                        'Cascadelake-Server must be an alias of versioned CPU model')

total: 2 errors, 8 warnings, 319 lines checked

Patch 38/43 has style problems, please review.  If any of these errors
are false positives report them to the maintainer, see
CHECKPATCH in MAINTAINERS.

39/43 Checking commit 1f7eb57566a2 (docs: Deprecate CPU model runnability guarantees)
40/43 Checking commit 372daf905e41 (i386: Add Cascadelake-Server-v2 CPU model)
WARNING: Block comments use a leading /* on a separate line
#45: FILE: target/i386/cpu.c:2355:
+                  { /* end of list */ }

WARNING: Block comments use a leading /* on a separate line
#48: FILE: target/i386/cpu.c:2358:
+            { /* end of list */ }

ERROR: line over 90 characters
#78: FILE: tests/acceptance/x86_cpu_model_versions.py:242:
+        vm.add_args('-cpu', 'Cascadelake-Server,x-force-features=on,check=off,enforce=off')

ERROR: line over 90 characters
#81: FILE: tests/acceptance/x86_cpu_model_versions.py:245:
+                         'pc-i440fx-4.1 + Cascadelake-Server should not have arch-capabilities')

ERROR: line over 90 characters
#86: FILE: tests/acceptance/x86_cpu_model_versions.py:250:
+        vm.add_args('-cpu', 'Cascadelake-Server,x-force-features=on,check=off,enforce=off')

ERROR: line over 90 characters
#89: FILE: tests/acceptance/x86_cpu_model_versions.py:253:
+                         'pc-i440fx-4.0 + Cascadelake-Server should not have arch-capabilities')

ERROR: line over 90 characters
#95: FILE: tests/acceptance/x86_cpu_model_versions.py:259:
+        vm.add_args('-cpu', 'Cascadelake-Server,x-force-features=on,check=off,enforce=off,+arch-capabilities')

ERROR: line over 90 characters
#98: FILE: tests/acceptance/x86_cpu_model_versions.py:262:
+                        'pc-i440fx-4.0 + Cascadelake-Server,+arch-capabilities should have arch-capabilities')

ERROR: line over 90 characters
#103: FILE: tests/acceptance/x86_cpu_model_versions.py:267:
+        vm.add_args('-cpu', 'Cascadelake-Server,x-force-features=on,check=off,enforce=off,-arch-capabilities')

ERROR: line over 90 characters
#106: FILE: tests/acceptance/x86_cpu_model_versions.py:270:
+                         'pc-i440fx-4.1 + Cascadelake-Server,-arch-capabilities should not have arch-capabilities')

ERROR: line over 90 characters
#112: FILE: tests/acceptance/x86_cpu_model_versions.py:276:
+        vm.add_args('-cpu', 'Cascadelake-Server-v1,x-force-features=on,check=off,enforce=off')

ERROR: line over 90 characters
#115: FILE: tests/acceptance/x86_cpu_model_versions.py:279:
+                         'pc-i440fx-4.1 + Cascadelake-Server-v1 should not have arch-capabilities')

ERROR: line over 90 characters
#120: FILE: tests/acceptance/x86_cpu_model_versions.py:284:
+        vm.add_args('-cpu', 'Cascadelake-Server-v2,x-force-features=on,check=off,enforce=off')

ERROR: line over 90 characters
#123: FILE: tests/acceptance/x86_cpu_model_versions.py:287:
+                         'pc-i440fx-4.1 + Cascadelake-Server-v1 should have arch-capabilities')

ERROR: line over 90 characters
#129: FILE: tests/acceptance/x86_cpu_model_versions.py:293:
+        vm.add_args('-cpu', 'Cascadelake-Server,x-force-features=on,check=off,enforce=off,+arch-capabilities')

ERROR: line over 90 characters
#132: FILE: tests/acceptance/x86_cpu_model_versions.py:296:
+                         'pc-i440fx-4.0 + Cascadelake-Server-v1,+arch-capabilities should have arch-capabilities')

ERROR: line over 90 characters
#137: FILE: tests/acceptance/x86_cpu_model_versions.py:301:
+        vm.add_args('-cpu', 'Cascadelake-Server-v2,x-force-features=on,check=off,enforce=off,-arch-capabilities')

ERROR: line over 90 characters
#140: FILE: tests/acceptance/x86_cpu_model_versions.py:304:
+                         'pc-i440fx-4.1 + Cascadelake-Server-v2,-arch-capabilities should not have arch-capabilities')

total: 16 errors, 2 warnings, 102 lines checked

Patch 40/43 has style problems, please review.  If any of these errors
are false positives report them to the maintainer, see
CHECKPATCH in MAINTAINERS.

41/43 Checking commit 764f45e604df (numa: Make deprecation warnings conditional on !qtest_enabled())
WARNING: line over 80 characters
#52: FILE: hw/core/numa.c:412:
+                warn_report("Default splitting of RAM between nodes is deprecated,"

total: 0 errors, 1 warnings, 33 lines checked

Patch 41/43 has style problems, please review.  If any of these errors
are false positives report them to the maintainer, see
CHECKPATCH in MAINTAINERS.
42/43 Checking commit 447d6d477c04 (numa: allow memory-less nodes when using memdev as backend)
43/43 Checking commit e26968f29e46 (tests: use -numa memdev option in tests instead of legacy 'mem' option)
=== OUTPUT END ===

Test command exited with code: 1


The full log is available at
http://patchew.org/logs/20190703210821.27550-1-ehabkost@redhat.com/testing.checkpatch/?type=message.
---
Email generated automatically by Patchew [https://patchew.org/].
Please send your feedback to patchew-devel@redhat.com
no-reply@patchew.org July 4, 2019, 1:03 a.m. UTC | #2
Patchew URL: https://patchew.org/QEMU/20190703210821.27550-1-ehabkost@redhat.com/



Hi,

This series failed the asan build test. Please find the testing commands and
their output below. If you have Docker installed, you can probably reproduce it
locally.

=== TEST SCRIPT BEGIN ===
#!/bin/bash
make docker-image-fedora V=1 NETWORK=1
time make docker-test-debug@fedora TARGET_LIST=x86_64-softmmu J=14 NETWORK=1
=== TEST SCRIPT END ===

PASS 1 fdc-test /x86_64/fdc/cmos
PASS 2 fdc-test /x86_64/fdc/no_media_on_start
PASS 3 fdc-test /x86_64/fdc/read_without_media
==8618==WARNING: ASan doesn't fully support makecontext/swapcontext functions and may produce false positives in some cases!
PASS 4 fdc-test /x86_64/fdc/media_change
PASS 5 fdc-test /x86_64/fdc/sense_interrupt
PASS 6 fdc-test /x86_64/fdc/relative_seek
---
PASS 32 test-opts-visitor /visitor/opts/range/beyond
PASS 33 test-opts-visitor /visitor/opts/dict/unvisited
MALLOC_PERTURB_=${MALLOC_PERTURB_:-$(( ${RANDOM:-0} % 255 + 1))}  tests/test-coroutine -m=quick -k --tap < /dev/null | ./scripts/tap-driver.pl --test-name="test-coroutine" 
==8679==WARNING: ASan doesn't fully support makecontext/swapcontext functions and may produce false positives in some cases!
PASS 1 test-coroutine /basic/no-dangling-access
PASS 2 test-coroutine /basic/lifecycle
==8679==WARNING: ASan is ignoring requested __asan_handle_no_return: stack top: 0x7fff3fdf7000; bottom 0x7f48d0af8000; size: 0x00b66f2ff000 (783549460480)
False positive error reports may follow
For details see https://github.com/google/sanitizers/issues/189
PASS 3 test-coroutine /basic/yield
---
PASS 11 test-aio /aio/event/wait
PASS 12 test-aio /aio/event/flush
PASS 13 test-aio /aio/event/wait/no-flush-cb
==8694==WARNING: ASan doesn't fully support makecontext/swapcontext functions and may produce false positives in some cases!
PASS 14 test-aio /aio/timer/schedule
PASS 15 test-aio /aio/coroutine/queue-chaining
PASS 16 test-aio /aio-gsource/flush
---
PASS 28 test-aio /aio-gsource/timer/schedule
MALLOC_PERTURB_=${MALLOC_PERTURB_:-$(( ${RANDOM:-0} % 255 + 1))}  tests/test-aio-multithread -m=quick -k --tap < /dev/null | ./scripts/tap-driver.pl --test-name="test-aio-multithread" 
PASS 1 test-aio-multithread /aio/multi/lifecycle
==8706==WARNING: ASan doesn't fully support makecontext/swapcontext functions and may produce false positives in some cases!
==8704==WARNING: ASan doesn't fully support makecontext/swapcontext functions and may produce false positives in some cases!
PASS 1 ide-test /x86_64/ide/identify
PASS 2 test-aio-multithread /aio/multi/schedule
==8724==WARNING: ASan doesn't fully support makecontext/swapcontext functions and may produce false positives in some cases!
PASS 3 test-aio-multithread /aio/multi/mutex/contended
PASS 2 ide-test /x86_64/ide/flush
==8740==WARNING: ASan doesn't fully support makecontext/swapcontext functions and may produce false positives in some cases!
PASS 3 ide-test /x86_64/ide/bmdma/simple_rw
==8747==WARNING: ASan doesn't fully support makecontext/swapcontext functions and may produce false positives in some cases!
PASS 4 test-aio-multithread /aio/multi/mutex/handoff
PASS 4 ide-test /x86_64/ide/bmdma/trim
==8758==WARNING: ASan doesn't fully support makecontext/swapcontext functions and may produce false positives in some cases!
PASS 5 ide-test /x86_64/ide/bmdma/short_prdt
PASS 5 test-aio-multithread /aio/multi/mutex/mcs
==8764==WARNING: ASan doesn't fully support makecontext/swapcontext functions and may produce false positives in some cases!
PASS 6 ide-test /x86_64/ide/bmdma/one_sector_short_prdt
PASS 6 test-aio-multithread /aio/multi/mutex/pthread
MALLOC_PERTURB_=${MALLOC_PERTURB_:-$(( ${RANDOM:-0} % 255 + 1))}  tests/test-throttle -m=quick -k --tap < /dev/null | ./scripts/tap-driver.pl --test-name="test-throttle" 
==8775==WARNING: ASan doesn't fully support makecontext/swapcontext functions and may produce false positives in some cases!
PASS 1 test-throttle /throttle/leak_bucket
==8781==WARNING: ASan doesn't fully support makecontext/swapcontext functions and may produce false positives in some cases!
PASS 2 test-throttle /throttle/compute_wait
PASS 3 test-throttle /throttle/init
PASS 4 test-throttle /throttle/destroy
---
PASS 15 test-throttle /throttle/config/iops_size
MALLOC_PERTURB_=${MALLOC_PERTURB_:-$(( ${RANDOM:-0} % 255 + 1))}  tests/test-thread-pool -m=quick -k --tap < /dev/null | ./scripts/tap-driver.pl --test-name="test-thread-pool" 
PASS 7 ide-test /x86_64/ide/bmdma/long_prdt
==8788==WARNING: ASan doesn't fully support makecontext/swapcontext functions and may produce false positives in some cases!
PASS 1 test-thread-pool /thread-pool/submit
PASS 2 test-thread-pool /thread-pool/submit-aio
PASS 3 test-thread-pool /thread-pool/submit-co
PASS 4 test-thread-pool /thread-pool/submit-many
==8790==WARNING: ASan doesn't fully support makecontext/swapcontext functions and may produce false positives in some cases!
==8790==WARNING: ASan is ignoring requested __asan_handle_no_return: stack top: 0x7ffed1a81000; bottom 0x7f68827dc000; size: 0x00964f2a5000 (645573267456)
False positive error reports may follow
For details see https://github.com/google/sanitizers/issues/189
PASS 8 ide-test /x86_64/ide/bmdma/no_busmaster
PASS 9 ide-test /x86_64/ide/flush/nodev
PASS 5 test-thread-pool /thread-pool/cancel
==8866==WARNING: ASan doesn't fully support makecontext/swapcontext functions and may produce false positives in some cases!
PASS 10 ide-test /x86_64/ide/flush/empty_drive
==8871==WARNING: ASan doesn't fully support makecontext/swapcontext functions and may produce false positives in some cases!
PASS 11 ide-test /x86_64/ide/flush/retry_pci
PASS 6 test-thread-pool /thread-pool/cancel-async
==8877==WARNING: ASan doesn't fully support makecontext/swapcontext functions and may produce false positives in some cases!
MALLOC_PERTURB_=${MALLOC_PERTURB_:-$(( ${RANDOM:-0} % 255 + 1))}  tests/test-hbitmap -m=quick -k --tap < /dev/null | ./scripts/tap-driver.pl --test-name="test-hbitmap" 
PASS 1 test-hbitmap /hbitmap/granularity
PASS 2 test-hbitmap /hbitmap/size/0
---
PASS 5 test-hbitmap /hbitmap/iter/partial
PASS 6 test-hbitmap /hbitmap/iter/granularity
PASS 7 test-hbitmap /hbitmap/iter/iter_and_reset
==8888==WARNING: ASan doesn't fully support makecontext/swapcontext functions and may produce false positives in some cases!
PASS 8 test-hbitmap /hbitmap/get/all
PASS 9 test-hbitmap /hbitmap/get/some
PASS 10 test-hbitmap /hbitmap/set/all
---
PASS 13 ide-test /x86_64/ide/cdrom/pio
PASS 15 test-hbitmap /hbitmap/set/overlap
PASS 16 test-hbitmap /hbitmap/reset/empty
==8894==WARNING: ASan doesn't fully support makecontext/swapcontext functions and may produce false positives in some cases!
PASS 17 test-hbitmap /hbitmap/reset/general
PASS 18 test-hbitmap /hbitmap/reset/all
PASS 19 test-hbitmap /hbitmap/truncate/nop
---
PASS 29 test-hbitmap /hbitmap/truncate/shrink/large
PASS 30 test-hbitmap /hbitmap/meta/zero
PASS 14 ide-test /x86_64/ide/cdrom/pio_large
==8900==WARNING: ASan doesn't fully support makecontext/swapcontext functions and may produce false positives in some cases!
PASS 15 ide-test /x86_64/ide/cdrom/dma
MALLOC_PERTURB_=${MALLOC_PERTURB_:-$(( ${RANDOM:-0} % 255 + 1))}  QTEST_QEMU_BINARY=x86_64-softmmu/qemu-system-x86_64 QTEST_QEMU_IMG=qemu-img tests/ahci-test -m=quick -k --tap < /dev/null | ./scripts/tap-driver.pl --test-name="ahci-test" 
==8914==WARNING: ASan doesn't fully support makecontext/swapcontext functions and may produce false positives in some cases!
PASS 1 ahci-test /x86_64/ahci/sanity
==8920==WARNING: ASan doesn't fully support makecontext/swapcontext functions and may produce false positives in some cases!
PASS 2 ahci-test /x86_64/ahci/pci_spec
PASS 31 test-hbitmap /hbitmap/meta/one
PASS 32 test-hbitmap /hbitmap/meta/byte
PASS 33 test-hbitmap /hbitmap/meta/word
==8926==WARNING: ASan doesn't fully support makecontext/swapcontext functions and may produce false positives in some cases!
PASS 3 ahci-test /x86_64/ahci/pci_enable
==8932==WARNING: ASan doesn't fully support makecontext/swapcontext functions and may produce false positives in some cases!
PASS 34 test-hbitmap /hbitmap/meta/sector
PASS 35 test-hbitmap /hbitmap/serialize/align
PASS 4 ahci-test /x86_64/ahci/hba_spec
==8938==WARNING: ASan doesn't fully support makecontext/swapcontext functions and may produce false positives in some cases!
PASS 5 ahci-test /x86_64/ahci/hba_enable
PASS 36 test-hbitmap /hbitmap/serialize/basic
PASS 37 test-hbitmap /hbitmap/serialize/part
PASS 38 test-hbitmap /hbitmap/serialize/zeroes
PASS 39 test-hbitmap /hbitmap/next_zero/next_zero_0
PASS 40 test-hbitmap /hbitmap/next_zero/next_zero_4
==8944==WARNING: ASan doesn't fully support makecontext/swapcontext functions and may produce false positives in some cases!
PASS 41 test-hbitmap /hbitmap/next_dirty_area/next_dirty_area_0
PASS 42 test-hbitmap /hbitmap/next_dirty_area/next_dirty_area_1
PASS 43 test-hbitmap /hbitmap/next_dirty_area/next_dirty_area_4
MALLOC_PERTURB_=${MALLOC_PERTURB_:-$(( ${RANDOM:-0} % 255 + 1))}  tests/test-bdrv-drain -m=quick -k --tap < /dev/null | ./scripts/tap-driver.pl --test-name="test-bdrv-drain" 
==8951==WARNING: ASan doesn't fully support makecontext/swapcontext functions and may produce false positives in some cases!
PASS 1 test-bdrv-drain /bdrv-drain/nested
PASS 2 test-bdrv-drain /bdrv-drain/multiparent
PASS 3 test-bdrv-drain /bdrv-drain/set_aio_context
---
PASS 37 test-bdrv-drain /bdrv-drain/detach/parent_cb
PASS 38 test-bdrv-drain /bdrv-drain/detach/driver_cb
PASS 39 test-bdrv-drain /bdrv-drain/attach/drain
==8971==WARNING: ASan doesn't fully support makecontext/swapcontext functions and may produce false positives in some cases!
MALLOC_PERTURB_=${MALLOC_PERTURB_:-$(( ${RANDOM:-0} % 255 + 1))}  tests/test-bdrv-graph-mod -m=quick -k --tap < /dev/null | ./scripts/tap-driver.pl --test-name="test-bdrv-graph-mod" 
==8997==WARNING: ASan doesn't fully support makecontext/swapcontext functions and may produce false positives in some cases!
PASS 1 test-bdrv-graph-mod /bdrv-graph-mod/update-perm-tree
PASS 2 test-bdrv-graph-mod /bdrv-graph-mod/should-update-child
MALLOC_PERTURB_=${MALLOC_PERTURB_:-$(( ${RANDOM:-0} % 255 + 1))}  tests/test-blockjob -m=quick -k --tap < /dev/null | ./scripts/tap-driver.pl --test-name="test-blockjob" 
PASS 7 ahci-test /x86_64/ahci/max
==9003==WARNING: ASan doesn't fully support makecontext/swapcontext functions and may produce false positives in some cases!
PASS 1 test-blockjob /blockjob/ids
PASS 2 test-blockjob /blockjob/cancel/created
PASS 3 test-blockjob /blockjob/cancel/running
---
PASS 7 test-blockjob /blockjob/cancel/pending
PASS 8 test-blockjob /blockjob/cancel/concluded
MALLOC_PERTURB_=${MALLOC_PERTURB_:-$(( ${RANDOM:-0} % 255 + 1))}  tests/test-blockjob-txn -m=quick -k --tap < /dev/null | ./scripts/tap-driver.pl --test-name="test-blockjob-txn" 
==9005==WARNING: ASan doesn't fully support makecontext/swapcontext functions and may produce false positives in some cases!
==9009==WARNING: ASan doesn't fully support makecontext/swapcontext functions and may produce false positives in some cases!
PASS 1 test-blockjob-txn /single/success
PASS 2 test-blockjob-txn /single/failure
PASS 3 test-blockjob-txn /single/cancel
---
PASS 6 test-blockjob-txn /pair/cancel
PASS 7 test-blockjob-txn /pair/fail-cancel-race
MALLOC_PERTURB_=${MALLOC_PERTURB_:-$(( ${RANDOM:-0} % 255 + 1))}  tests/test-block-backend -m=quick -k --tap < /dev/null | ./scripts/tap-driver.pl --test-name="test-block-backend" 
==9018==WARNING: ASan doesn't fully support makecontext/swapcontext functions and may produce false positives in some cases!
PASS 1 test-block-backend /block-backend/drain_aio_error
PASS 2 test-block-backend /block-backend/drain_all_aio_error
MALLOC_PERTURB_=${MALLOC_PERTURB_:-$(( ${RANDOM:-0} % 255 + 1))}  tests/test-block-iothread -m=quick -k --tap < /dev/null | ./scripts/tap-driver.pl --test-name="test-block-iothread" 
==9023==WARNING: ASan doesn't fully support makecontext/swapcontext functions and may produce false positives in some cases!
PASS 1 test-block-iothread /sync-op/pread
PASS 2 test-block-iothread /sync-op/pwrite
PASS 3 test-block-iothread /sync-op/load_vmstate
---
PASS 15 test-block-iothread /propagate/diamond
PASS 16 test-block-iothread /propagate/mirror
MALLOC_PERTURB_=${MALLOC_PERTURB_:-$(( ${RANDOM:-0} % 255 + 1))}  tests/test-image-locking -m=quick -k --tap < /dev/null | ./scripts/tap-driver.pl --test-name="test-image-locking" 
==9044==WARNING: ASan doesn't fully support makecontext/swapcontext functions and may produce false positives in some cases!
PASS 1 test-image-locking /image-locking/basic
PASS 2 test-image-locking /image-locking/set-perm-abort
MALLOC_PERTURB_=${MALLOC_PERTURB_:-$(( ${RANDOM:-0} % 255 + 1))}  tests/test-x86-cpuid -m=quick -k --tap < /dev/null | ./scripts/tap-driver.pl --test-name="test-x86-cpuid" 
---
PASS 3 test-xbzrle /xbzrle/encode_decode_unchanged
PASS 4 test-xbzrle /xbzrle/encode_decode_1_byte
PASS 5 test-xbzrle /xbzrle/encode_decode_overflow
==9056==WARNING: ASan doesn't fully support makecontext/swapcontext functions and may produce false positives in some cases!
PASS 6 test-xbzrle /xbzrle/encode_decode
==9056==WARNING: ASan is ignoring requested __asan_handle_no_return: stack top: 0x7ffe2e2af000; bottom 0x7fbbbf1fe000; size: 0x00426f0b1000 (285330837504)
False positive error reports may follow
For details see https://github.com/google/sanitizers/issues/189
MALLOC_PERTURB_=${MALLOC_PERTURB_:-$(( ${RANDOM:-0} % 255 + 1))}  tests/test-vmstate -m=quick -k --tap < /dev/null | ./scripts/tap-driver.pl --test-name="test-vmstate" 
---
PASS 1 test-shift128 /host-utils/test_lshift
PASS 2 test-shift128 /host-utils/test_rshift
MALLOC_PERTURB_=${MALLOC_PERTURB_:-$(( ${RANDOM:-0} % 255 + 1))}  tests/test-mul64 -m=quick -k --tap < /dev/null | ./scripts/tap-driver.pl --test-name="test-mul64" 
==9073==WARNING: ASan doesn't fully support makecontext/swapcontext functions and may produce false positives in some cases!
PASS 1 test-mul64 /host-utils/mulu64
PASS 2 test-mul64 /host-utils/muls64
MALLOC_PERTURB_=${MALLOC_PERTURB_:-$(( ${RANDOM:-0} % 255 + 1))}  tests/test-int128 -m=quick -k --tap < /dev/null | ./scripts/tap-driver.pl --test-name="test-int128" 
---
PASS 9 test-int128 /int128/int128_gt
PASS 10 test-int128 /int128/int128_rshift
MALLOC_PERTURB_=${MALLOC_PERTURB_:-$(( ${RANDOM:-0} % 255 + 1))}  tests/rcutorture -m=quick -k --tap < /dev/null | ./scripts/tap-driver.pl --test-name="rcutorture" 
==9073==WARNING: ASan is ignoring requested __asan_handle_no_return: stack top: 0x7fff3abef000; bottom 0x7f7aa7ffe000; size: 0x008492bf1000 (569397678080)
False positive error reports may follow
For details see https://github.com/google/sanitizers/issues/189
PASS 10 ahci-test /x86_64/ahci/io/pio/lba28/simple/low
==9101==WARNING: ASan doesn't fully support makecontext/swapcontext functions and may produce false positives in some cases!
PASS 1 rcutorture /rcu/torture/1reader
==9101==WARNING: ASan is ignoring requested __asan_handle_no_return: stack top: 0x7fff056ff000; bottom 0x7f8a5e9fe000; size: 0x0074a6d01000 (501014859776)
False positive error reports may follow
For details see https://github.com/google/sanitizers/issues/189
PASS 11 ahci-test /x86_64/ahci/io/pio/lba28/simple/high
PASS 2 rcutorture /rcu/torture/10readers
MALLOC_PERTURB_=${MALLOC_PERTURB_:-$(( ${RANDOM:-0} % 255 + 1))}  tests/test-rcu-list -m=quick -k --tap < /dev/null | ./scripts/tap-driver.pl --test-name="test-rcu-list" 
==9123==WARNING: ASan doesn't fully support makecontext/swapcontext functions and may produce false positives in some cases!
==9123==WARNING: ASan is ignoring requested __asan_handle_no_return: stack top: 0x7fff07cfc000; bottom 0x7f1a2b5fe000; size: 0x00e4dc6fe000 (982950862848)
False positive error reports may follow
For details see https://github.com/google/sanitizers/issues/189
PASS 1 test-rcu-list /rcu/qlist/single-threaded
PASS 12 ahci-test /x86_64/ahci/io/pio/lba28/double/zero
PASS 2 test-rcu-list /rcu/qlist/short-few
==9142==WARNING: ASan doesn't fully support makecontext/swapcontext functions and may produce false positives in some cases!
==9142==WARNING: ASan is ignoring requested __asan_handle_no_return: stack top: 0x7fff31c58000; bottom 0x7f372adfe000; size: 0x00c806e5a000 (859109171200)
False positive error reports may follow
For details see https://github.com/google/sanitizers/issues/189
PASS 13 ahci-test /x86_64/ahci/io/pio/lba28/double/low
==9169==WARNING: ASan doesn't fully support makecontext/swapcontext functions and may produce false positives in some cases!
==9169==WARNING: ASan is ignoring requested __asan_handle_no_return: stack top: 0x7ffeff1d1000; bottom 0x7ff318dfe000; size: 0x000be63d3000 (51107409920)
False positive error reports may follow
For details see https://github.com/google/sanitizers/issues/189
PASS 3 test-rcu-list /rcu/qlist/long-many
MALLOC_PERTURB_=${MALLOC_PERTURB_:-$(( ${RANDOM:-0} % 255 + 1))}  tests/test-rcu-simpleq -m=quick -k --tap < /dev/null | ./scripts/tap-driver.pl --test-name="test-rcu-simpleq" 
PASS 14 ahci-test /x86_64/ahci/io/pio/lba28/double/high
==9182==WARNING: ASan doesn't fully support makecontext/swapcontext functions and may produce false positives in some cases!
PASS 1 test-rcu-simpleq /rcu/qsimpleq/single-threaded
==9182==WARNING: ASan is ignoring requested __asan_handle_no_return: stack top: 0x7ffe468a9000; bottom 0x7f76dadfe000; size: 0x00876baab000 (581626933248)
False positive error reports may follow
For details see https://github.com/google/sanitizers/issues/189
PASS 2 test-rcu-simpleq /rcu/qsimpleq/short-few
PASS 15 ahci-test /x86_64/ahci/io/pio/lba28/long/zero
==9215==WARNING: ASan doesn't fully support makecontext/swapcontext functions and may produce false positives in some cases!
==9215==WARNING: ASan is ignoring requested __asan_handle_no_return: stack top: 0x7fff87c53000; bottom 0x7ff8e0b7c000; size: 0x0006a70d7000 (28572479488)
False positive error reports may follow
For details see https://github.com/google/sanitizers/issues/189
PASS 3 test-rcu-simpleq /rcu/qsimpleq/long-many
MALLOC_PERTURB_=${MALLOC_PERTURB_:-$(( ${RANDOM:-0} % 255 + 1))}  tests/test-rcu-tailq -m=quick -k --tap < /dev/null | ./scripts/tap-driver.pl --test-name="test-rcu-tailq" 
PASS 16 ahci-test /x86_64/ahci/io/pio/lba28/long/low
==9228==WARNING: ASan doesn't fully support makecontext/swapcontext functions and may produce false positives in some cases!
PASS 1 test-rcu-tailq /rcu/qtailq/single-threaded
==9228==WARNING: ASan is ignoring requested __asan_handle_no_return: stack top: 0x7ffe1b200000; bottom 0x7fa9cfdfe000; size: 0x00544b402000 (362039746560)
False positive error reports may follow
For details see https://github.com/google/sanitizers/issues/189
PASS 2 test-rcu-tailq /rcu/qtailq/short-few
PASS 17 ahci-test /x86_64/ahci/io/pio/lba28/long/high
==9261==WARNING: ASan doesn't fully support makecontext/swapcontext functions and may produce false positives in some cases!
PASS 18 ahci-test /x86_64/ahci/io/pio/lba28/short/zero
==9267==WARNING: ASan doesn't fully support makecontext/swapcontext functions and may produce false positives in some cases!
PASS 3 test-rcu-tailq /rcu/qtailq/long-many
MALLOC_PERTURB_=${MALLOC_PERTURB_:-$(( ${RANDOM:-0} % 255 + 1))}  tests/test-qdist -m=quick -k --tap < /dev/null | ./scripts/tap-driver.pl --test-name="test-qdist" 
PASS 1 test-qdist /qdist/none
---
PASS 8 test-qdist /qdist/binning/shrink
MALLOC_PERTURB_=${MALLOC_PERTURB_:-$(( ${RANDOM:-0} % 255 + 1))}  tests/test-qht -m=quick -k --tap < /dev/null | ./scripts/tap-driver.pl --test-name="test-qht" 
PASS 19 ahci-test /x86_64/ahci/io/pio/lba28/short/low
==9281==WARNING: ASan doesn't fully support makecontext/swapcontext functions and may produce false positives in some cases!
PASS 20 ahci-test /x86_64/ahci/io/pio/lba28/short/high
==9288==WARNING: ASan doesn't fully support makecontext/swapcontext functions and may produce false positives in some cases!
==9288==WARNING: ASan is ignoring requested __asan_handle_no_return: stack top: 0x7fffb8a53000; bottom 0x7f12cb3fe000; size: 0x00eced655000 (1017595121664)
False positive error reports may follow
For details see https://github.com/google/sanitizers/issues/189
PASS 21 ahci-test /x86_64/ahci/io/pio/lba48/simple/zero
==9294==WARNING: ASan doesn't fully support makecontext/swapcontext functions and may produce false positives in some cases!
==9294==WARNING: ASan is ignoring requested __asan_handle_no_return: stack top: 0x7fff28e4f000; bottom 0x7fd76e1fe000; size: 0x0027bac51000 (170637201408)
False positive error reports may follow
For details see https://github.com/google/sanitizers/issues/189
PASS 22 ahci-test /x86_64/ahci/io/pio/lba48/simple/low
==9300==WARNING: ASan doesn't fully support makecontext/swapcontext functions and may produce false positives in some cases!
==9300==WARNING: ASan is ignoring requested __asan_handle_no_return: stack top: 0x7ffc68c51000; bottom 0x7f23df1fe000; size: 0x00d889a53000 (930022240256)
False positive error reports may follow
For details see https://github.com/google/sanitizers/issues/189
PASS 23 ahci-test /x86_64/ahci/io/pio/lba48/simple/high
==9306==WARNING: ASan doesn't fully support makecontext/swapcontext functions and may produce false positives in some cases!
==9306==WARNING: ASan is ignoring requested __asan_handle_no_return: stack top: 0x7fff10843000; bottom 0x7fb7317fe000; size: 0x0047df045000 (308684279808)
False positive error reports may follow
For details see https://github.com/google/sanitizers/issues/189
PASS 24 ahci-test /x86_64/ahci/io/pio/lba48/double/zero
==9312==WARNING: ASan doesn't fully support makecontext/swapcontext functions and may produce false positives in some cases!
==9312==WARNING: ASan is ignoring requested __asan_handle_no_return: stack top: 0x7ffef26c1000; bottom 0x7fedceffe000; size: 0x0011236c3000 (73608736768)
False positive error reports may follow
For details see https://github.com/google/sanitizers/issues/189
PASS 25 ahci-test /x86_64/ahci/io/pio/lba48/double/low
==9318==WARNING: ASan doesn't fully support makecontext/swapcontext functions and may produce false positives in some cases!
==9318==WARNING: ASan is ignoring requested __asan_handle_no_return: stack top: 0x7ffedecd6000; bottom 0x7fdf09ffe000; size: 0x001fd4cd8000 (136714223616)
False positive error reports may follow
For details see https://github.com/google/sanitizers/issues/189
PASS 26 ahci-test /x86_64/ahci/io/pio/lba48/double/high
==9324==WARNING: ASan doesn't fully support makecontext/swapcontext functions and may produce false positives in some cases!
==9324==WARNING: ASan is ignoring requested __asan_handle_no_return: stack top: 0x7ffff9eff000; bottom 0x7fcae5ffe000; size: 0x003513f01000 (227967766528)
False positive error reports may follow
For details see https://github.com/google/sanitizers/issues/189
PASS 27 ahci-test /x86_64/ahci/io/pio/lba48/long/zero
==9330==WARNING: ASan doesn't fully support makecontext/swapcontext functions and may produce false positives in some cases!
==9330==WARNING: ASan is ignoring requested __asan_handle_no_return: stack top: 0x7ffe4af67000; bottom 0x7f80af17c000; size: 0x007d9bdeb000 (539485974528)
False positive error reports may follow
For details see https://github.com/google/sanitizers/issues/189
PASS 1 test-qht /qht/mode/default
---
PASS 3 test-qdev-global-props /qdev/properties/dynamic/global
PASS 4 test-qdev-global-props /qdev/properties/global/subclass
MALLOC_PERTURB_=${MALLOC_PERTURB_:-$(( ${RANDOM:-0} % 255 + 1))}  tests/check-qom-interface -m=quick -k --tap < /dev/null | ./scripts/tap-driver.pl --test-name="check-qom-interface" 
==9363==WARNING: ASan doesn't fully support makecontext/swapcontext functions and may produce false positives in some cases!
PASS 1 check-qom-interface /qom/interface/direct_impl
PASS 2 check-qom-interface /qom/interface/intermediate_impl
MALLOC_PERTURB_=${MALLOC_PERTURB_:-$(( ${RANDOM:-0} % 255 + 1))}  tests/check-qom-proplist -m=quick -k --tap < /dev/null | ./scripts/tap-driver.pl --test-name="check-qom-proplist" 
==9363==WARNING: ASan is ignoring requested __asan_handle_no_return: stack top: 0x7ffcc403e000; bottom 0x7f7182324000; size: 0x008b41d1a000 (598104711168)
False positive error reports may follow
For details see https://github.com/google/sanitizers/issues/189
PASS 1 check-qom-proplist /qom/proplist/createlist
---
PASS 16 test-crypto-secret /crypto/secret/crypt/badiv
MALLOC_PERTURB_=${MALLOC_PERTURB_:-$(( ${RANDOM:-0} % 255 + 1))}  tests/test-crypto-tlscredsx509 -m=quick -k --tap < /dev/null | ./scripts/tap-driver.pl --test-name="test-crypto-tlscredsx509" 
PASS 29 ahci-test /x86_64/ahci/io/pio/lba48/long/high
==9425==WARNING: ASan doesn't fully support makecontext/swapcontext functions and may produce false positives in some cases!
PASS 1 test-crypto-tlscredsx509 /qcrypto/tlscredsx509/perfectserver
PASS 2 test-crypto-tlscredsx509 /qcrypto/tlscredsx509/perfectclient
PASS 30 ahci-test /x86_64/ahci/io/pio/lba48/short/zero
PASS 3 test-crypto-tlscredsx509 /qcrypto/tlscredsx509/goodca1
==9431==WARNING: ASan doesn't fully support makecontext/swapcontext functions and may produce false positives in some cases!
PASS 4 test-crypto-tlscredsx509 /qcrypto/tlscredsx509/goodca2
PASS 31 ahci-test /x86_64/ahci/io/pio/lba48/short/low
PASS 5 test-crypto-tlscredsx509 /qcrypto/tlscredsx509/goodca3
PASS 6 test-crypto-tlscredsx509 /qcrypto/tlscredsx509/badca1
PASS 7 test-crypto-tlscredsx509 /qcrypto/tlscredsx509/badca2
PASS 8 test-crypto-tlscredsx509 /qcrypto/tlscredsx509/badca3
==9437==WARNING: ASan doesn't fully support makecontext/swapcontext functions and may produce false positives in some cases!
PASS 9 test-crypto-tlscredsx509 /qcrypto/tlscredsx509/goodserver1
PASS 32 ahci-test /x86_64/ahci/io/pio/lba48/short/high
PASS 10 test-crypto-tlscredsx509 /qcrypto/tlscredsx509/goodserver2
PASS 11 test-crypto-tlscredsx509 /qcrypto/tlscredsx509/goodserver3
==9443==WARNING: ASan doesn't fully support makecontext/swapcontext functions and may produce false positives in some cases!
PASS 33 ahci-test /x86_64/ahci/io/dma/lba28/fragmented
PASS 12 test-crypto-tlscredsx509 /qcrypto/tlscredsx509/goodserver4
==9449==WARNING: ASan doesn't fully support makecontext/swapcontext functions and may produce false positives in some cases!
PASS 13 test-crypto-tlscredsx509 /qcrypto/tlscredsx509/goodserver5
PASS 34 ahci-test /x86_64/ahci/io/dma/lba28/retry
PASS 14 test-crypto-tlscredsx509 /qcrypto/tlscredsx509/goodserver6
==9455==WARNING: ASan doesn't fully support makecontext/swapcontext functions and may produce false positives in some cases!
PASS 15 test-crypto-tlscredsx509 /qcrypto/tlscredsx509/goodserver7
PASS 16 test-crypto-tlscredsx509 /qcrypto/tlscredsx509/badserver1
PASS 17 test-crypto-tlscredsx509 /qcrypto/tlscredsx509/badserver2
---
PASS 39 test-crypto-tlscredsx509 /qcrypto/tlscredsx509/missingclient
PASS 35 ahci-test /x86_64/ahci/io/dma/lba28/simple/zero
MALLOC_PERTURB_=${MALLOC_PERTURB_:-$(( ${RANDOM:-0} % 255 + 1))}  tests/test-crypto-tlssession -m=quick -k --tap < /dev/null | ./scripts/tap-driver.pl --test-name="test-crypto-tlssession" 
==9462==WARNING: ASan doesn't fully support makecontext/swapcontext functions and may produce false positives in some cases!
PASS 1 test-crypto-tlssession /qcrypto/tlssession/psk
PASS 36 ahci-test /x86_64/ahci/io/dma/lba28/simple/low
==9472==WARNING: ASan doesn't fully support makecontext/swapcontext functions and may produce false positives in some cases!
PASS 2 test-crypto-tlssession /qcrypto/tlssession/basicca
PASS 3 test-crypto-tlssession /qcrypto/tlssession/differentca
PASS 37 ahci-test /x86_64/ahci/io/dma/lba28/simple/high
==9478==WARNING: ASan doesn't fully support makecontext/swapcontext functions and may produce false positives in some cases!
PASS 38 ahci-test /x86_64/ahci/io/dma/lba28/double/zero
PASS 4 test-crypto-tlssession /qcrypto/tlssession/altname1
==9484==WARNING: ASan doesn't fully support makecontext/swapcontext functions and may produce false positives in some cases!
PASS 39 ahci-test /x86_64/ahci/io/dma/lba28/double/low
==9491==WARNING: ASan doesn't fully support makecontext/swapcontext functions and may produce false positives in some cases!
PASS 40 ahci-test /x86_64/ahci/io/dma/lba28/double/high
PASS 5 test-crypto-tlssession /qcrypto/tlssession/altname2
==9497==WARNING: ASan doesn't fully support makecontext/swapcontext functions and may produce false positives in some cases!
PASS 6 test-crypto-tlssession /qcrypto/tlssession/altname3
PASS 41 ahci-test /x86_64/ahci/io/dma/lba28/long/zero
==9503==WARNING: ASan doesn't fully support makecontext/swapcontext functions and may produce false positives in some cases!
PASS 42 ahci-test /x86_64/ahci/io/dma/lba28/long/low
==9509==WARNING: ASan doesn't fully support makecontext/swapcontext functions and may produce false positives in some cases!
PASS 7 test-crypto-tlssession /qcrypto/tlssession/altname4
PASS 43 ahci-test /x86_64/ahci/io/dma/lba28/long/high
==9515==WARNING: ASan doesn't fully support makecontext/swapcontext functions and may produce false positives in some cases!
PASS 8 test-crypto-tlssession /qcrypto/tlssession/altname5
PASS 9 test-crypto-tlssession /qcrypto/tlssession/altname6
PASS 10 test-crypto-tlssession /qcrypto/tlssession/wildcard1
PASS 44 ahci-test /x86_64/ahci/io/dma/lba28/short/zero
PASS 11 test-crypto-tlssession /qcrypto/tlssession/wildcard2
==9521==WARNING: ASan doesn't fully support makecontext/swapcontext functions and may produce false positives in some cases!
PASS 45 ahci-test /x86_64/ahci/io/dma/lba28/short/low
==9527==WARNING: ASan doesn't fully support makecontext/swapcontext functions and may produce false positives in some cases!
PASS 46 ahci-test /x86_64/ahci/io/dma/lba28/short/high
==9533==WARNING: ASan doesn't fully support makecontext/swapcontext functions and may produce false positives in some cases!
PASS 12 test-crypto-tlssession /qcrypto/tlssession/wildcard3
PASS 47 ahci-test /x86_64/ahci/io/dma/lba48/simple/zero
==9539==WARNING: ASan doesn't fully support makecontext/swapcontext functions and may produce false positives in some cases!
PASS 13 test-crypto-tlssession /qcrypto/tlssession/wildcard4
PASS 48 ahci-test /x86_64/ahci/io/dma/lba48/simple/low
==9545==WARNING: ASan doesn't fully support makecontext/swapcontext functions and may produce false positives in some cases!
PASS 49 ahci-test /x86_64/ahci/io/dma/lba48/simple/high
==9551==WARNING: ASan doesn't fully support makecontext/swapcontext functions and may produce false positives in some cases!
PASS 14 test-crypto-tlssession /qcrypto/tlssession/wildcard5
PASS 15 test-crypto-tlssession /qcrypto/tlssession/wildcard6
PASS 16 test-crypto-tlssession /qcrypto/tlssession/cachain
PASS 50 ahci-test /x86_64/ahci/io/dma/lba48/double/zero
MALLOC_PERTURB_=${MALLOC_PERTURB_:-$(( ${RANDOM:-0} % 255 + 1))}  tests/test-qga -m=quick -k --tap < /dev/null | ./scripts/tap-driver.pl --test-name="test-qga" 
==9558==WARNING: ASan doesn't fully support makecontext/swapcontext functions and may produce false positives in some cases!
PASS 1 test-qga /qga/sync-delimited
PASS 2 test-qga /qga/sync
PASS 3 test-qga /qga/ping
---
PASS 16 test-qga /qga/invalid-args
PASS 17 test-qga /qga/fsfreeze-status
PASS 51 ahci-test /x86_64/ahci/io/dma/lba48/double/low
==9570==WARNING: ASan doesn't fully support makecontext/swapcontext functions and may produce false positives in some cases!
PASS 18 test-qga /qga/blacklist
PASS 19 test-qga /qga/config
PASS 20 test-qga /qga/guest-exec
PASS 21 test-qga /qga/guest-exec-invalid
PASS 52 ahci-test /x86_64/ahci/io/dma/lba48/double/high
==9583==WARNING: ASan doesn't fully support makecontext/swapcontext functions and may produce false positives in some cases!
PASS 22 test-qga /qga/guest-get-osinfo
PASS 23 test-qga /qga/guest-get-host-name
PASS 24 test-qga /qga/guest-get-timezone
---
MALLOC_PERTURB_=${MALLOC_PERTURB_:-$(( ${RANDOM:-0} % 255 + 1))}  tests/test-util-filemonitor -m=quick -k --tap < /dev/null | ./scripts/tap-driver.pl --test-name="test-util-filemonitor" 
PASS 1 test-util-filemonitor /util/filemonitor
MALLOC_PERTURB_=${MALLOC_PERTURB_:-$(( ${RANDOM:-0} % 255 + 1))}  tests/test-util-sockets -m=quick -k --tap < /dev/null | ./scripts/tap-driver.pl --test-name="test-util-sockets" 
==9597==WARNING: ASan doesn't fully support makecontext/swapcontext functions and may produce false positives in some cases!
PASS 1 test-util-sockets /util/socket/is-socket/bad
PASS 2 test-util-sockets /util/socket/is-socket/good
PASS 3 test-util-sockets /socket/fd-pass/name/good
---
PASS 4 test-io-channel-file /io/channel/pipe/sync
PASS 5 test-io-channel-file /io/channel/pipe/async
MALLOC_PERTURB_=${MALLOC_PERTURB_:-$(( ${RANDOM:-0} % 255 + 1))}  tests/test-io-channel-tls -m=quick -k --tap < /dev/null | ./scripts/tap-driver.pl --test-name="test-io-channel-tls" 
==9679==WARNING: ASan doesn't fully support makecontext/swapcontext functions and may produce false positives in some cases!
PASS 55 ahci-test /x86_64/ahci/io/dma/lba48/long/high
==9696==WARNING: ASan doesn't fully support makecontext/swapcontext functions and may produce false positives in some cases!
PASS 1 test-io-channel-tls /qio/channel/tls/basic
MALLOC_PERTURB_=${MALLOC_PERTURB_:-$(( ${RANDOM:-0} % 255 + 1))}  tests/test-io-channel-command -m=quick -k --tap < /dev/null | ./scripts/tap-driver.pl --test-name="test-io-channel-command" 
PASS 1 test-io-channel-command /io/channel/command/fifo/sync
---
PASS 56 ahci-test /x86_64/ahci/io/dma/lba48/short/zero
PASS 1 test-io-channel-buffer /io/channel/buf
MALLOC_PERTURB_=${MALLOC_PERTURB_:-$(( ${RANDOM:-0} % 255 + 1))}  tests/test-base64 -m=quick -k --tap < /dev/null | ./scripts/tap-driver.pl --test-name="test-base64" 
==9717==WARNING: ASan doesn't fully support makecontext/swapcontext functions and may produce false positives in some cases!
PASS 1 test-base64 /util/base64/good
PASS 2 test-base64 /util/base64/embedded-nul
PASS 3 test-base64 /util/base64/not-nul-terminated
---
MALLOC_PERTURB_=${MALLOC_PERTURB_:-$(( ${RANDOM:-0} % 255 + 1))}  tests/test-crypto-block -m=quick -k --tap < /dev/null | ./scripts/tap-driver.pl --test-name="test-crypto-block" 
PASS 1 test-crypto-block /crypto/block/qcow
MALLOC_PERTURB_=${MALLOC_PERTURB_:-$(( ${RANDOM:-0} % 255 + 1))}  tests/test-logging -m=quick -k --tap < /dev/null | ./scripts/tap-driver.pl --test-name="test-logging" 
==9747==WARNING: ASan doesn't fully support makecontext/swapcontext functions and may produce false positives in some cases!
PASS 1 test-logging /logging/parse_range
PASS 2 test-logging /logging/parse_path
MALLOC_PERTURB_=${MALLOC_PERTURB_:-$(( ${RANDOM:-0} % 255 + 1))}  tests/test-replication -m=quick -k --tap < /dev/null | ./scripts/tap-driver.pl --test-name="test-replication" 
==9762==WARNING: ASan doesn't fully support makecontext/swapcontext functions and may produce false positives in some cases!
PASS 58 ahci-test /x86_64/ahci/io/dma/lba48/short/high
PASS 1 test-replication /replication/primary/read
PASS 2 test-replication /replication/primary/write
==9767==WARNING: ASan doesn't fully support makecontext/swapcontext functions and may produce false positives in some cases!
PASS 59 ahci-test /x86_64/ahci/io/ncq/simple
==9773==WARNING: ASan doesn't fully support makecontext/swapcontext functions and may produce false positives in some cases!
PASS 3 test-replication /replication/primary/start
PASS 4 test-replication /replication/primary/stop
PASS 5 test-replication /replication/primary/do_checkpoint
PASS 6 test-replication /replication/primary/get_error_all
PASS 60 ahci-test /x86_64/ahci/io/ncq/retry
==9779==WARNING: ASan doesn't fully support makecontext/swapcontext functions and may produce false positives in some cases!
PASS 61 ahci-test /x86_64/ahci/flush/simple
==9785==WARNING: ASan doesn't fully support makecontext/swapcontext functions and may produce false positives in some cases!
PASS 7 test-replication /replication/secondary/read
PASS 62 ahci-test /x86_64/ahci/flush/retry
==9791==WARNING: ASan doesn't fully support makecontext/swapcontext functions and may produce false positives in some cases!
PASS 8 test-replication /replication/secondary/write
==9796==WARNING: ASan doesn't fully support makecontext/swapcontext functions and may produce false positives in some cases!
PASS 63 ahci-test /x86_64/ahci/flush/migrate
==9805==WARNING: ASan doesn't fully support makecontext/swapcontext functions and may produce false positives in some cases!
==9810==WARNING: ASan doesn't fully support makecontext/swapcontext functions and may produce false positives in some cases!
==9762==WARNING: ASan is ignoring requested __asan_handle_no_return: stack top: 0x7ffc526f4000; bottom 0x7f9f255fc000; size: 0x005d2d0f8000 (400187949056)
False positive error reports may follow
For details see https://github.com/google/sanitizers/issues/189
PASS 9 test-replication /replication/secondary/start
PASS 64 ahci-test /x86_64/ahci/migrate/sanity
==9841==WARNING: ASan doesn't fully support makecontext/swapcontext functions and may produce false positives in some cases!
==9846==WARNING: ASan doesn't fully support makecontext/swapcontext functions and may produce false positives in some cases!
PASS 10 test-replication /replication/secondary/stop
PASS 65 ahci-test /x86_64/ahci/migrate/dma/simple
==9855==WARNING: ASan doesn't fully support makecontext/swapcontext functions and may produce false positives in some cases!
==9860==WARNING: ASan doesn't fully support makecontext/swapcontext functions and may produce false positives in some cases!
PASS 11 test-replication /replication/secondary/do_checkpoint
PASS 66 ahci-test /x86_64/ahci/migrate/dma/halted
==9869==WARNING: ASan doesn't fully support makecontext/swapcontext functions and may produce false positives in some cases!
PASS 12 test-replication /replication/secondary/get_error_all
MALLOC_PERTURB_=${MALLOC_PERTURB_:-$(( ${RANDOM:-0} % 255 + 1))}  tests/test-bufferiszero -m=quick -k --tap < /dev/null | ./scripts/tap-driver.pl --test-name="test-bufferiszero" 
==9875==WARNING: ASan doesn't fully support makecontext/swapcontext functions and may produce false positives in some cases!
PASS 67 ahci-test /x86_64/ahci/migrate/ncq/simple
==9887==WARNING: ASan doesn't fully support makecontext/swapcontext functions and may produce false positives in some cases!
==9892==WARNING: ASan doesn't fully support makecontext/swapcontext functions and may produce false positives in some cases!
PASS 68 ahci-test /x86_64/ahci/migrate/ncq/halted
==9901==WARNING: ASan doesn't fully support makecontext/swapcontext functions and may produce false positives in some cases!
PASS 69 ahci-test /x86_64/ahci/cdrom/eject
==9906==WARNING: ASan doesn't fully support makecontext/swapcontext functions and may produce false positives in some cases!
PASS 70 ahci-test /x86_64/ahci/cdrom/dma/single
==9912==WARNING: ASan doesn't fully support makecontext/swapcontext functions and may produce false positives in some cases!
PASS 71 ahci-test /x86_64/ahci/cdrom/dma/multi
==9918==WARNING: ASan doesn't fully support makecontext/swapcontext functions and may produce false positives in some cases!
PASS 72 ahci-test /x86_64/ahci/cdrom/pio/single
==9924==WARNING: ASan doesn't fully support makecontext/swapcontext functions and may produce false positives in some cases!
==9924==WARNING: ASan is ignoring requested __asan_handle_no_return: stack top: 0x7ffc09218000; bottom 0x7fb89fbfe000; size: 0x00436961a000 (289530814464)
False positive error reports may follow
For details see https://github.com/google/sanitizers/issues/189
PASS 73 ahci-test /x86_64/ahci/cdrom/pio/multi
==9930==WARNING: ASan doesn't fully support makecontext/swapcontext functions and may produce false positives in some cases!
PASS 74 ahci-test /x86_64/ahci/cdrom/pio/bcl
MALLOC_PERTURB_=${MALLOC_PERTURB_:-$(( ${RANDOM:-0} % 255 + 1))}  QTEST_QEMU_BINARY=x86_64-softmmu/qemu-system-x86_64 QTEST_QEMU_IMG=qemu-img tests/hd-geo-test -m=quick -k --tap < /dev/null | ./scripts/tap-driver.pl --test-name="hd-geo-test" 
PASS 1 hd-geo-test /x86_64/hd-geo/ide/none
==9944==WARNING: ASan doesn't fully support makecontext/swapcontext functions and may produce false positives in some cases!
PASS 2 hd-geo-test /x86_64/hd-geo/ide/drive/cd_0
==9950==WARNING: ASan doesn't fully support makecontext/swapcontext functions and may produce false positives in some cases!
PASS 3 hd-geo-test /x86_64/hd-geo/ide/drive/mbr/blank
==9956==WARNING: ASan doesn't fully support makecontext/swapcontext functions and may produce false positives in some cases!
PASS 4 hd-geo-test /x86_64/hd-geo/ide/drive/mbr/lba
==9962==WARNING: ASan doesn't fully support makecontext/swapcontext functions and may produce false positives in some cases!
PASS 5 hd-geo-test /x86_64/hd-geo/ide/drive/mbr/chs
==9968==WARNING: ASan doesn't fully support makecontext/swapcontext functions and may produce false positives in some cases!
PASS 6 hd-geo-test /x86_64/hd-geo/ide/device/mbr/blank
==9974==WARNING: ASan doesn't fully support makecontext/swapcontext functions and may produce false positives in some cases!
PASS 7 hd-geo-test /x86_64/hd-geo/ide/device/mbr/lba
==9980==WARNING: ASan doesn't fully support makecontext/swapcontext functions and may produce false positives in some cases!
PASS 8 hd-geo-test /x86_64/hd-geo/ide/device/mbr/chs
==9986==WARNING: ASan doesn't fully support makecontext/swapcontext functions and may produce false positives in some cases!
PASS 9 hd-geo-test /x86_64/hd-geo/ide/device/user/chs
==9991==WARNING: ASan doesn't fully support makecontext/swapcontext functions and may produce false positives in some cases!
PASS 10 hd-geo-test /x86_64/hd-geo/ide/device/user/chst
MALLOC_PERTURB_=${MALLOC_PERTURB_:-$(( ${RANDOM:-0} % 255 + 1))}  QTEST_QEMU_BINARY=x86_64-softmmu/qemu-system-x86_64 QTEST_QEMU_IMG=qemu-img tests/boot-order-test -m=quick -k --tap < /dev/null | ./scripts/tap-driver.pl --test-name="boot-order-test" 
PASS 1 test-bufferiszero /cutils/bufferiszero
---
Could not access KVM kernel module: No such file or directory
qemu-system-x86_64: failed to initialize KVM: No such file or directory
qemu-system-x86_64: Back to tcg accelerator
==10076==WARNING: ASan doesn't fully support makecontext/swapcontext functions and may produce false positives in some cases!
PASS 1 bios-tables-test /x86_64/acpi/piix4
Could not access KVM kernel module: No such file or directory
qemu-system-x86_64: failed to initialize KVM: No such file or directory
qemu-system-x86_64: Back to tcg accelerator
==10082==WARNING: ASan doesn't fully support makecontext/swapcontext functions and may produce false positives in some cases!
PASS 2 bios-tables-test /x86_64/acpi/q35
Could not access KVM kernel module: No such file or directory
qemu-system-x86_64: failed to initialize KVM: No such file or directory
qemu-system-x86_64: Back to tcg accelerator
==10088==WARNING: ASan doesn't fully support makecontext/swapcontext functions and may produce false positives in some cases!
PASS 3 bios-tables-test /x86_64/acpi/piix4/bridge
Could not access KVM kernel module: No such file or directory
qemu-system-x86_64: failed to initialize KVM: No such file or directory
qemu-system-x86_64: Back to tcg accelerator
==10094==WARNING: ASan doesn't fully support makecontext/swapcontext functions and may produce false positives in some cases!
PASS 4 bios-tables-test /x86_64/acpi/piix4/ipmi
Could not access KVM kernel module: No such file or directory
qemu-system-x86_64: failed to initialize KVM: No such file or directory
qemu-system-x86_64: Back to tcg accelerator
==10100==WARNING: ASan doesn't fully support makecontext/swapcontext functions and may produce false positives in some cases!
PASS 5 bios-tables-test /x86_64/acpi/piix4/cpuhp
Could not access KVM kernel module: No such file or directory
qemu-system-x86_64: failed to initialize KVM: No such file or directory
qemu-system-x86_64: Back to tcg accelerator
==10107==WARNING: ASan doesn't fully support makecontext/swapcontext functions and may produce false positives in some cases!
PASS 6 bios-tables-test /x86_64/acpi/piix4/memhp
Could not access KVM kernel module: No such file or directory
qemu-system-x86_64: failed to initialize KVM: No such file or directory
qemu-system-x86_64: Back to tcg accelerator
==10113==WARNING: ASan doesn't fully support makecontext/swapcontext functions and may produce false positives in some cases!
PASS 7 bios-tables-test /x86_64/acpi/piix4/numamem
Could not access KVM kernel module: No such file or directory
qemu-system-x86_64: failed to initialize KVM: No such file or directory
qemu-system-x86_64: Back to tcg accelerator
==10119==WARNING: ASan doesn't fully support makecontext/swapcontext functions and may produce false positives in some cases!
PASS 8 bios-tables-test /x86_64/acpi/piix4/dimmpxm
Could not access KVM kernel module: No such file or directory
qemu-system-x86_64: failed to initialize KVM: No such file or directory
qemu-system-x86_64: Back to tcg accelerator
==10128==WARNING: ASan doesn't fully support makecontext/swapcontext functions and may produce false positives in some cases!
PASS 9 bios-tables-test /x86_64/acpi/q35/bridge
Could not access KVM kernel module: No such file or directory
qemu-system-x86_64: failed to initialize KVM: No such file or directory
qemu-system-x86_64: Back to tcg accelerator
==10134==WARNING: ASan doesn't fully support makecontext/swapcontext functions and may produce false positives in some cases!
PASS 10 bios-tables-test /x86_64/acpi/q35/mmio64
Could not access KVM kernel module: No such file or directory
qemu-system-x86_64: failed to initialize KVM: No such file or directory
qemu-system-x86_64: Back to tcg accelerator
==10140==WARNING: ASan doesn't fully support makecontext/swapcontext functions and may produce false positives in some cases!
PASS 11 bios-tables-test /x86_64/acpi/q35/ipmi
Could not access KVM kernel module: No such file or directory
qemu-system-x86_64: failed to initialize KVM: No such file or directory
qemu-system-x86_64: Back to tcg accelerator
==10146==WARNING: ASan doesn't fully support makecontext/swapcontext functions and may produce false positives in some cases!
PASS 12 bios-tables-test /x86_64/acpi/q35/cpuhp
Could not access KVM kernel module: No such file or directory
qemu-system-x86_64: failed to initialize KVM: No such file or directory
qemu-system-x86_64: Back to tcg accelerator
==10153==WARNING: ASan doesn't fully support makecontext/swapcontext functions and may produce false positives in some cases!
PASS 13 bios-tables-test /x86_64/acpi/q35/memhp
Could not access KVM kernel module: No such file or directory
qemu-system-x86_64: failed to initialize KVM: No such file or directory
qemu-system-x86_64: Back to tcg accelerator
==10159==WARNING: ASan doesn't fully support makecontext/swapcontext functions and may produce false positives in some cases!
PASS 14 bios-tables-test /x86_64/acpi/q35/numamem
Could not access KVM kernel module: No such file or directory
qemu-system-x86_64: failed to initialize KVM: No such file or directory
qemu-system-x86_64: Back to tcg accelerator
==10165==WARNING: ASan doesn't fully support makecontext/swapcontext functions and may produce false positives in some cases!
PASS 15 bios-tables-test /x86_64/acpi/q35/dimmpxm
MALLOC_PERTURB_=${MALLOC_PERTURB_:-$(( ${RANDOM:-0} % 255 + 1))}  QTEST_QEMU_BINARY=x86_64-softmmu/qemu-system-x86_64 QTEST_QEMU_IMG=qemu-img tests/boot-serial-test -m=quick -k --tap < /dev/null | ./scripts/tap-driver.pl --test-name="boot-serial-test" 
PASS 1 boot-serial-test /x86_64/boot-serial/isapc
---
PASS 1 i440fx-test /x86_64/i440fx/defaults
PASS 2 i440fx-test /x86_64/i440fx/pam
PASS 3 i440fx-test /x86_64/i440fx/firmware/bios
==10249==WARNING: ASan doesn't fully support makecontext/swapcontext functions and may produce false positives in some cases!
PASS 4 i440fx-test /x86_64/i440fx/firmware/pflash
MALLOC_PERTURB_=${MALLOC_PERTURB_:-$(( ${RANDOM:-0} % 255 + 1))}  QTEST_QEMU_BINARY=x86_64-softmmu/qemu-system-x86_64 QTEST_QEMU_IMG=qemu-img tests/fw_cfg-test -m=quick -k --tap < /dev/null | ./scripts/tap-driver.pl --test-name="fw_cfg-test" 
PASS 1 fw_cfg-test /x86_64/fw_cfg/signature
---
MALLOC_PERTURB_=${MALLOC_PERTURB_:-$(( ${RANDOM:-0} % 255 + 1))}  QTEST_QEMU_BINARY=x86_64-softmmu/qemu-system-x86_64 QTEST_QEMU_IMG=qemu-img tests/drive_del-test -m=quick -k --tap < /dev/null | ./scripts/tap-driver.pl --test-name="drive_del-test" 
PASS 1 drive_del-test /x86_64/drive_del/without-dev
PASS 2 drive_del-test /x86_64/drive_del/after_failed_device_add
==10337==WARNING: ASan doesn't fully support makecontext/swapcontext functions and may produce false positives in some cases!
PASS 3 drive_del-test /x86_64/blockdev/drive_del_device_del
MALLOC_PERTURB_=${MALLOC_PERTURB_:-$(( ${RANDOM:-0} % 255 + 1))}  QTEST_QEMU_BINARY=x86_64-softmmu/qemu-system-x86_64 QTEST_QEMU_IMG=qemu-img tests/wdt_ib700-test -m=quick -k --tap < /dev/null | ./scripts/tap-driver.pl --test-name="wdt_ib700-test" 
PASS 1 wdt_ib700-test /x86_64/wdt_ib700/pause
---
PASS 1 usb-hcd-uhci-test /x86_64/uhci/pci/init
PASS 2 usb-hcd-uhci-test /x86_64/uhci/pci/port1
PASS 3 usb-hcd-uhci-test /x86_64/uhci/pci/hotplug
==10532==WARNING: ASan doesn't fully support makecontext/swapcontext functions and may produce false positives in some cases!
PASS 4 usb-hcd-uhci-test /x86_64/uhci/pci/hotplug/usb-storage
MALLOC_PERTURB_=${MALLOC_PERTURB_:-$(( ${RANDOM:-0} % 255 + 1))}  QTEST_QEMU_BINARY=x86_64-softmmu/qemu-system-x86_64 QTEST_QEMU_IMG=qemu-img tests/usb-hcd-xhci-test -m=quick -k --tap < /dev/null | ./scripts/tap-driver.pl --test-name="usb-hcd-xhci-test" 
PASS 1 usb-hcd-xhci-test /x86_64/xhci/pci/init
PASS 2 usb-hcd-xhci-test /x86_64/xhci/pci/hotplug
==10541==WARNING: ASan doesn't fully support makecontext/swapcontext functions and may produce false positives in some cases!
PASS 3 usb-hcd-xhci-test /x86_64/xhci/pci/hotplug/usb-uas
PASS 4 usb-hcd-xhci-test /x86_64/xhci/pci/hotplug/usb-ccid
MALLOC_PERTURB_=${MALLOC_PERTURB_:-$(( ${RANDOM:-0} % 255 + 1))}  QTEST_QEMU_BINARY=x86_64-softmmu/qemu-system-x86_64 QTEST_QEMU_IMG=qemu-img tests/cpu-plug-test -m=quick -k --tap < /dev/null | ./scripts/tap-driver.pl --test-name="cpu-plug-test" 
---
Could not access KVM kernel module: No such file or directory
qemu-system-x86_64: failed to initialize KVM: No such file or directory
qemu-system-x86_64: Back to tcg accelerator
==10647==WARNING: ASan doesn't fully support makecontext/swapcontext functions and may produce false positives in some cases!
PASS 1 vmgenid-test /x86_64/vmgenid/vmgenid/set-guid
Could not access KVM kernel module: No such file or directory
qemu-system-x86_64: failed to initialize KVM: No such file or directory
qemu-system-x86_64: Back to tcg accelerator
==10653==WARNING: ASan doesn't fully support makecontext/swapcontext functions and may produce false positives in some cases!
PASS 2 vmgenid-test /x86_64/vmgenid/vmgenid/set-guid-auto
Could not access KVM kernel module: No such file or directory
qemu-system-x86_64: failed to initialize KVM: No such file or directory
qemu-system-x86_64: Back to tcg accelerator
==10659==WARNING: ASan doesn't fully support makecontext/swapcontext functions and may produce false positives in some cases!
PASS 3 vmgenid-test /x86_64/vmgenid/vmgenid/query-monitor
MALLOC_PERTURB_=${MALLOC_PERTURB_:-$(( ${RANDOM:-0} % 255 + 1))}  QTEST_QEMU_BINARY=x86_64-softmmu/qemu-system-x86_64 QTEST_QEMU_IMG=qemu-img tests/tpm-crb-swtpm-test -m=quick -k --tap < /dev/null | ./scripts/tap-driver.pl --test-name="tpm-crb-swtpm-test" 
SKIP 1 tpm-crb-swtpm-test /x86_64/tpm/crb-swtpm/test # SKIP swtpm not in PATH or missing --tpm2 support
---
Could not access KVM kernel module: No such file or directory
qemu-system-x86_64: failed to initialize KVM: No such file or directory
qemu-system-x86_64: Back to tcg accelerator
==10764==WARNING: ASan doesn't fully support makecontext/swapcontext functions and may produce false positives in some cases!
Could not access KVM kernel module: No such file or directory
qemu-system-x86_64: failed to initialize KVM: No such file or directory
qemu-system-x86_64: Back to tcg accelerator
==10769==WARNING: ASan doesn't fully support makecontext/swapcontext functions and may produce false positives in some cases!
PASS 3 migration-test /x86_64/migration/fd_proto
Could not access KVM kernel module: No such file or directory
qemu-system-x86_64: failed to initialize KVM: No such file or directory
qemu-system-x86_64: Back to tcg accelerator
==10777==WARNING: ASan doesn't fully support makecontext/swapcontext functions and may produce false positives in some cases!
Could not access KVM kernel module: No such file or directory
qemu-system-x86_64: failed to initialize KVM: No such file or directory
qemu-system-x86_64: Back to tcg accelerator
==10782==WARNING: ASan doesn't fully support makecontext/swapcontext functions and may produce false positives in some cases!
PASS 4 migration-test /x86_64/migration/postcopy/unix
PASS 5 migration-test /x86_64/migration/postcopy/recovery
Could not access KVM kernel module: No such file or directory
qemu-system-x86_64: failed to initialize KVM: No such file or directory
qemu-system-x86_64: Back to tcg accelerator
==10812==WARNING: ASan doesn't fully support makecontext/swapcontext functions and may produce false positives in some cases!
Could not access KVM kernel module: No such file or directory
qemu-system-x86_64: failed to initialize KVM: No such file or directory
qemu-system-x86_64: Back to tcg accelerator
==10817==WARNING: ASan doesn't fully support makecontext/swapcontext functions and may produce false positives in some cases!
PASS 6 migration-test /x86_64/migration/precopy/unix
Could not access KVM kernel module: No such file or directory
qemu-system-x86_64: failed to initialize KVM: No such file or directory
qemu-system-x86_64: Back to tcg accelerator
==10826==WARNING: ASan doesn't fully support makecontext/swapcontext functions and may produce false positives in some cases!
Could not access KVM kernel module: No such file or directory
qemu-system-x86_64: failed to initialize KVM: No such file or directory
qemu-system-x86_64: Back to tcg accelerator
==10831==WARNING: ASan doesn't fully support makecontext/swapcontext functions and may produce false positives in some cases!
PASS 7 migration-test /x86_64/migration/precopy/tcp
Could not access KVM kernel module: No such file or directory
qemu-system-x86_64: failed to initialize KVM: No such file or directory
qemu-system-x86_64: Back to tcg accelerator
==10840==WARNING: ASan doesn't fully support makecontext/swapcontext functions and may produce false positives in some cases!
Could not access KVM kernel module: No such file or directory
qemu-system-x86_64: failed to initialize KVM: No such file or directory
qemu-system-x86_64: Back to tcg accelerator
==10845==WARNING: ASan doesn't fully support makecontext/swapcontext functions and may produce false positives in some cases!
PASS 8 migration-test /x86_64/migration/xbzrle/unix
MALLOC_PERTURB_=${MALLOC_PERTURB_:-$(( ${RANDOM:-0} % 255 + 1))}  QTEST_QEMU_BINARY=x86_64-softmmu/qemu-system-x86_64 QTEST_QEMU_IMG=qemu-img tests/test-x86-cpuid-compat -m=quick -k --tap < /dev/null | ./scripts/tap-driver.pl --test-name="test-x86-cpuid-compat" 
PASS 1 test-x86-cpuid-compat /x86/cpuid/parsing-plus-minus
---
PASS 6 numa-test /x86_64/numa/pc/dynamic/cpu
MALLOC_PERTURB_=${MALLOC_PERTURB_:-$(( ${RANDOM:-0} % 255 + 1))}  QTEST_QEMU_BINARY=x86_64-softmmu/qemu-system-x86_64 QTEST_QEMU_IMG=qemu-img tests/qmp-test -m=quick -k --tap < /dev/null | ./scripts/tap-driver.pl --test-name="qmp-test" 
PASS 1 qmp-test /x86_64/qmp/protocol
==11174==WARNING: ASan doesn't fully support makecontext/swapcontext functions and may produce false positives in some cases!
PASS 2 qmp-test /x86_64/qmp/oob
PASS 3 qmp-test /x86_64/qmp/preconfig
PASS 4 qmp-test /x86_64/qmp/missing-any-arg
---
PASS 5 device-introspect-test /x86_64/device/introspect/abstract-interfaces

=================================================================
==11422==ERROR: LeakSanitizer: detected memory leaks

Direct leak of 32 byte(s) in 1 object(s) allocated from:
    #0 0x55970f14eb6e in calloc (/tmp/qemu-test/build/x86_64-softmmu/qemu-system-x86_64+0x1a02b6e)
---

SUMMARY: AddressSanitizer: 64 byte(s) leaked in 2 allocation(s).
/tmp/qemu-test/src/tests/libqtest.c:137: kill_qemu() tried to terminate QEMU process but encountered exit status 1
ERROR - too few tests run (expected 6, got 5)
make: *** [/tmp/qemu-test/src/tests/Makefile.include:896: check-qtest-x86_64] Error 1
make: *** Waiting for unfinished jobs....
Traceback (most recent call last):


The full log is available at
http://patchew.org/logs/20190703210821.27550-1-ehabkost@redhat.com/testing.asan/?type=message.
---
Email generated automatically by Patchew [https://patchew.org/].
Please send your feedback to patchew-devel@redhat.com
Peter Maydell July 4, 2019, 1:54 p.m. UTC | #3
On Wed, 3 Jul 2019 at 22:08, Eduardo Habkost <ehabkost@redhat.com> wrote:
>
> Changes v4 -> v5:
> * Rebase and solve conflicts with commit 374f63f6810a ("Merge remote-tracking
>   branch 'remotes/armbru/tags/pull-monitor-2019-07-02-v2' into staging")
>
> Changes v3 -> v4:
> * Fix ppc64 "make check" failure
>
> Changes v2 -> v3:
> * Fix "make check" warnings (Igor Mammedov)
> * Fix conflicts of "hw/arm: Replace global smp variables with
>   machine smp properties" with recent arm changes (Eduardo Habkost)
> * x86 versioned CPU models (Eduardo Habkost)
> * SnowRidge CPU model (Paul Lai)
> * Add deprecation information to query-machines (Eduardo Habkost)
>
> Changes v1 -> v2:
> * Fix s390x build failure
>
>
> The following changes since commit 374f63f6810a2f99254cdf32af67035d951301c8:
>
>   Merge remote-tracking branch 'remotes/armbru/tags/pull-monitor-2019-07-02-v2' into staging (2019-07-03 00:16:43 +0100)
>
> are available in the Git repository at:
>
>   git://github.com/ehabkost/qemu.git tags/machine-next-pull-request
>
> for you to fetch changes up to adae41278c7e3472b1f4f0228c37dbcfd95fa6a5:
>
>   tests: use -numa memdev option in tests instead of legacy 'mem' option (2019-07-03 15:41:29 -0300)
>
> ----------------------------------------------------------------
> Machine and x86 queue, 2019-07-03
>
> * CPU die topology support (Like Xu)
> * Deprecation of features (Igor Mammedov):
>   * 'mem' parameter of '-numa node' option
>   * implict memory distribution between NUMA nodes
>   * deprecate -mem-path fallback to anonymous RAM
> * x86 versioned CPU models (Eduardo Habkost)
> * SnowRidge CPU model (Paul Lai)
> * Add deprecation information to query-machines (Eduardo Habkost)
> * Other i386 fixes
>

Hi; this fails to link (all platforms):

hw/riscv/sifive_u.o: In function `riscv_sifive_u_soc_realize':
/home/petmay01/linaro/qemu-for-merges/hw/riscv/sifive_u.c:356:
undefined reference to `smp_cpus'
/home/petmay01/linaro/qemu-for-merges/hw/riscv/sifive_u.c:358:
undefined reference to `smp_cpus'
collect2: error: ld returned 1 exit status

I guess you have a conflict with the recent riscv pullreq.

thanks
-- PMM