migration/postcopy: fix document of postcopy_send_discard_bm_ram()
diff mbox series

Message ID 20190703011234.20517-1-richardw.yang@linux.intel.com
State New
Headers show
Series
  • migration/postcopy: fix document of postcopy_send_discard_bm_ram()
Related show

Commit Message

Wei Yang July 3, 2019, 1:12 a.m. UTC
Commit 6b6712efccd3 ('ram: Split dirty bitmap by RAMBlock') changes the
parameter of postcopy_send_discard_bm_ram(), while left the document
part untouched.

This patch correct the document and fix one typo by hand.

Signed-off-by: Wei Yang <richardw.yang@linux.intel.com>
---
 migration/ram.c | 5 ++---
 1 file changed, 2 insertions(+), 3 deletions(-)

Comments

no-reply@patchew.org July 3, 2019, 5:20 a.m. UTC | #1
Patchew URL: https://patchew.org/QEMU/20190703011234.20517-1-richardw.yang@linux.intel.com/



Hi,

This series failed the asan build test. Please find the testing commands and
their output below. If you have Docker installed, you can probably reproduce it
locally.

=== TEST SCRIPT BEGIN ===
#!/bin/bash
make docker-image-fedora V=1 NETWORK=1
time make docker-test-debug@fedora TARGET_LIST=x86_64-softmmu J=14 NETWORK=1
=== TEST SCRIPT END ===

PASS 1 fdc-test /x86_64/fdc/cmos
PASS 2 fdc-test /x86_64/fdc/no_media_on_start
PASS 3 fdc-test /x86_64/fdc/read_without_media
==9336==WARNING: ASan doesn't fully support makecontext/swapcontext functions and may produce false positives in some cases!
PASS 1 check-qnull /public/qnull_ref
PASS 4 fdc-test /x86_64/fdc/media_change
PASS 2 check-qnull /public/qnull_visit
---
PASS 32 test-opts-visitor /visitor/opts/range/beyond
PASS 33 test-opts-visitor /visitor/opts/dict/unvisited
MALLOC_PERTURB_=${MALLOC_PERTURB_:-$(( ${RANDOM:-0} % 255 + 1))}  tests/test-coroutine -m=quick -k --tap < /dev/null | ./scripts/tap-driver.pl --test-name="test-coroutine" 
==9419==WARNING: ASan doesn't fully support makecontext/swapcontext functions and may produce false positives in some cases!
==9419==WARNING: ASan is ignoring requested __asan_handle_no_return: stack top: 0x7fff12eb2000; bottom 0x7ffa7e0f8000; size: 0x000494dba000 (19677290496)
False positive error reports may follow
For details see https://github.com/google/sanitizers/issues/189
PASS 1 test-coroutine /basic/no-dangling-access
---
PASS 11 test-aio /aio/event/wait
PASS 12 test-aio /aio/event/flush
PASS 13 test-aio /aio/event/wait/no-flush-cb
==9434==WARNING: ASan doesn't fully support makecontext/swapcontext functions and may produce false positives in some cases!
PASS 14 test-aio /aio/timer/schedule
PASS 15 test-aio /aio/coroutine/queue-chaining
PASS 16 test-aio /aio-gsource/flush
---
PASS 13 fdc-test /x86_64/fdc/fuzz-registers
MALLOC_PERTURB_=${MALLOC_PERTURB_:-$(( ${RANDOM:-0} % 255 + 1))}  tests/test-aio-multithread -m=quick -k --tap < /dev/null | ./scripts/tap-driver.pl --test-name="test-aio-multithread" 
PASS 1 test-aio-multithread /aio/multi/lifecycle
==9441==WARNING: ASan doesn't fully support makecontext/swapcontext functions and may produce false positives in some cases!
MALLOC_PERTURB_=${MALLOC_PERTURB_:-$(( ${RANDOM:-0} % 255 + 1))}  QTEST_QEMU_BINARY=x86_64-softmmu/qemu-system-x86_64 QTEST_QEMU_IMG=qemu-img tests/ide-test -m=quick -k --tap < /dev/null | ./scripts/tap-driver.pl --test-name="ide-test" 
PASS 2 test-aio-multithread /aio/multi/schedule
==9458==WARNING: ASan doesn't fully support makecontext/swapcontext functions and may produce false positives in some cases!
PASS 1 ide-test /x86_64/ide/identify
==9469==WARNING: ASan doesn't fully support makecontext/swapcontext functions and may produce false positives in some cases!
PASS 3 test-aio-multithread /aio/multi/mutex/contended
PASS 2 ide-test /x86_64/ide/flush
==9480==WARNING: ASan doesn't fully support makecontext/swapcontext functions and may produce false positives in some cases!
PASS 3 ide-test /x86_64/ide/bmdma/simple_rw
==9486==WARNING: ASan doesn't fully support makecontext/swapcontext functions and may produce false positives in some cases!
PASS 4 ide-test /x86_64/ide/bmdma/trim
==9492==WARNING: ASan doesn't fully support makecontext/swapcontext functions and may produce false positives in some cases!
PASS 4 test-aio-multithread /aio/multi/mutex/handoff
PASS 5 ide-test /x86_64/ide/bmdma/short_prdt
==9503==WARNING: ASan doesn't fully support makecontext/swapcontext functions and may produce false positives in some cases!
PASS 6 ide-test /x86_64/ide/bmdma/one_sector_short_prdt
PASS 5 test-aio-multithread /aio/multi/mutex/mcs
==9509==WARNING: ASan doesn't fully support makecontext/swapcontext functions and may produce false positives in some cases!
PASS 7 ide-test /x86_64/ide/bmdma/long_prdt
PASS 6 test-aio-multithread /aio/multi/mutex/pthread
MALLOC_PERTURB_=${MALLOC_PERTURB_:-$(( ${RANDOM:-0} % 255 + 1))}  tests/test-throttle -m=quick -k --tap < /dev/null | ./scripts/tap-driver.pl --test-name="test-throttle" 
==9520==WARNING: ASan doesn't fully support makecontext/swapcontext functions and may produce false positives in some cases!
==9526==WARNING: ASan doesn't fully support makecontext/swapcontext functions and may produce false positives in some cases!
PASS 1 test-throttle /throttle/leak_bucket
PASS 2 test-throttle /throttle/compute_wait
PASS 3 test-throttle /throttle/init
---
PASS 13 test-throttle /throttle/config/ranges
PASS 14 test-throttle /throttle/config/max
PASS 15 test-throttle /throttle/config/iops_size
==9520==WARNING: ASan is ignoring requested __asan_handle_no_return: stack top: 0x7ffe7272a000; bottom 0x7f99ca5fe000; size: 0x0064a812c000 (432316530688)
False positive error reports may follow
For details see https://github.com/google/sanitizers/issues/189
MALLOC_PERTURB_=${MALLOC_PERTURB_:-$(( ${RANDOM:-0} % 255 + 1))}  tests/test-thread-pool -m=quick -k --tap < /dev/null | ./scripts/tap-driver.pl --test-name="test-thread-pool" 
==9533==WARNING: ASan doesn't fully support makecontext/swapcontext functions and may produce false positives in some cases!
PASS 1 test-thread-pool /thread-pool/submit
PASS 2 test-thread-pool /thread-pool/submit-aio
PASS 3 test-thread-pool /thread-pool/submit-co
PASS 4 test-thread-pool /thread-pool/submit-many
PASS 8 ide-test /x86_64/ide/bmdma/no_busmaster
PASS 9 ide-test /x86_64/ide/flush/nodev
==9589==WARNING: ASan doesn't fully support makecontext/swapcontext functions and may produce false positives in some cases!
PASS 5 test-thread-pool /thread-pool/cancel
PASS 10 ide-test /x86_64/ide/flush/empty_drive
==9594==WARNING: ASan doesn't fully support makecontext/swapcontext functions and may produce false positives in some cases!
PASS 11 ide-test /x86_64/ide/flush/retry_pci
PASS 6 test-thread-pool /thread-pool/cancel-async
==9600==WARNING: ASan doesn't fully support makecontext/swapcontext functions and may produce false positives in some cases!
MALLOC_PERTURB_=${MALLOC_PERTURB_:-$(( ${RANDOM:-0} % 255 + 1))}  tests/test-hbitmap -m=quick -k --tap < /dev/null | ./scripts/tap-driver.pl --test-name="test-hbitmap" 
PASS 12 ide-test /x86_64/ide/flush/retry_isa
PASS 1 test-hbitmap /hbitmap/granularity
---
PASS 3 test-hbitmap /hbitmap/size/unaligned
PASS 4 test-hbitmap /hbitmap/iter/empty
PASS 5 test-hbitmap /hbitmap/iter/partial
==9611==WARNING: ASan doesn't fully support makecontext/swapcontext functions and may produce false positives in some cases!
PASS 6 test-hbitmap /hbitmap/iter/granularity
PASS 7 test-hbitmap /hbitmap/iter/iter_and_reset
PASS 8 test-hbitmap /hbitmap/get/all
---
PASS 14 test-hbitmap /hbitmap/set/twice
PASS 15 test-hbitmap /hbitmap/set/overlap
PASS 16 test-hbitmap /hbitmap/reset/empty
==9617==WARNING: ASan doesn't fully support makecontext/swapcontext functions and may produce false positives in some cases!
PASS 17 test-hbitmap /hbitmap/reset/general
PASS 18 test-hbitmap /hbitmap/reset/all
PASS 19 test-hbitmap /hbitmap/truncate/nop
---
PASS 29 test-hbitmap /hbitmap/truncate/shrink/large
PASS 30 test-hbitmap /hbitmap/meta/zero
PASS 14 ide-test /x86_64/ide/cdrom/pio_large
==9623==WARNING: ASan doesn't fully support makecontext/swapcontext functions and may produce false positives in some cases!
PASS 15 ide-test /x86_64/ide/cdrom/dma
MALLOC_PERTURB_=${MALLOC_PERTURB_:-$(( ${RANDOM:-0} % 255 + 1))}  QTEST_QEMU_BINARY=x86_64-softmmu/qemu-system-x86_64 QTEST_QEMU_IMG=qemu-img tests/ahci-test -m=quick -k --tap < /dev/null | ./scripts/tap-driver.pl --test-name="ahci-test" 
==9637==WARNING: ASan doesn't fully support makecontext/swapcontext functions and may produce false positives in some cases!
PASS 1 ahci-test /x86_64/ahci/sanity
==9643==WARNING: ASan doesn't fully support makecontext/swapcontext functions and may produce false positives in some cases!
PASS 2 ahci-test /x86_64/ahci/pci_spec
==9649==WARNING: ASan doesn't fully support makecontext/swapcontext functions and may produce false positives in some cases!
PASS 3 ahci-test /x86_64/ahci/pci_enable
PASS 31 test-hbitmap /hbitmap/meta/one
PASS 32 test-hbitmap /hbitmap/meta/byte
PASS 33 test-hbitmap /hbitmap/meta/word
==9655==WARNING: ASan doesn't fully support makecontext/swapcontext functions and may produce false positives in some cases!
PASS 34 test-hbitmap /hbitmap/meta/sector
PASS 35 test-hbitmap /hbitmap/serialize/align
PASS 4 ahci-test /x86_64/ahci/hba_spec
==9661==WARNING: ASan doesn't fully support makecontext/swapcontext functions and may produce false positives in some cases!
PASS 5 ahci-test /x86_64/ahci/hba_enable
==9667==WARNING: ASan doesn't fully support makecontext/swapcontext functions and may produce false positives in some cases!
PASS 36 test-hbitmap /hbitmap/serialize/basic
PASS 37 test-hbitmap /hbitmap/serialize/part
PASS 38 test-hbitmap /hbitmap/serialize/zeroes
---
PASS 42 test-hbitmap /hbitmap/next_dirty_area/next_dirty_area_1
PASS 43 test-hbitmap /hbitmap/next_dirty_area/next_dirty_area_4
MALLOC_PERTURB_=${MALLOC_PERTURB_:-$(( ${RANDOM:-0} % 255 + 1))}  tests/test-bdrv-drain -m=quick -k --tap < /dev/null | ./scripts/tap-driver.pl --test-name="test-bdrv-drain" 
==9676==WARNING: ASan doesn't fully support makecontext/swapcontext functions and may produce false positives in some cases!
==9673==WARNING: ASan doesn't fully support makecontext/swapcontext functions and may produce false positives in some cases!
PASS 1 test-bdrv-drain /bdrv-drain/nested
PASS 2 test-bdrv-drain /bdrv-drain/multiparent
PASS 3 test-bdrv-drain /bdrv-drain/set_aio_context
---
PASS 39 test-bdrv-drain /bdrv-drain/attach/drain
PASS 7 ahci-test /x86_64/ahci/max
MALLOC_PERTURB_=${MALLOC_PERTURB_:-$(( ${RANDOM:-0} % 255 + 1))}  tests/test-bdrv-graph-mod -m=quick -k --tap < /dev/null | ./scripts/tap-driver.pl --test-name="test-bdrv-graph-mod" 
==9722==WARNING: ASan doesn't fully support makecontext/swapcontext functions and may produce false positives in some cases!
==9720==WARNING: ASan doesn't fully support makecontext/swapcontext functions and may produce false positives in some cases!
PASS 1 test-bdrv-graph-mod /bdrv-graph-mod/update-perm-tree
PASS 2 test-bdrv-graph-mod /bdrv-graph-mod/should-update-child
MALLOC_PERTURB_=${MALLOC_PERTURB_:-$(( ${RANDOM:-0} % 255 + 1))}  tests/test-blockjob -m=quick -k --tap < /dev/null | ./scripts/tap-driver.pl --test-name="test-blockjob" 
==9731==WARNING: ASan doesn't fully support makecontext/swapcontext functions and may produce false positives in some cases!
PASS 1 test-blockjob /blockjob/ids
PASS 2 test-blockjob /blockjob/cancel/created
PASS 3 test-blockjob /blockjob/cancel/running
---
PASS 7 test-blockjob /blockjob/cancel/pending
PASS 8 test-blockjob /blockjob/cancel/concluded
MALLOC_PERTURB_=${MALLOC_PERTURB_:-$(( ${RANDOM:-0} % 255 + 1))}  tests/test-blockjob-txn -m=quick -k --tap < /dev/null | ./scripts/tap-driver.pl --test-name="test-blockjob-txn" 
==9736==WARNING: ASan doesn't fully support makecontext/swapcontext functions and may produce false positives in some cases!
PASS 1 test-blockjob-txn /single/success
PASS 2 test-blockjob-txn /single/failure
PASS 3 test-blockjob-txn /single/cancel
---
PASS 6 test-blockjob-txn /pair/cancel
PASS 7 test-blockjob-txn /pair/fail-cancel-race
MALLOC_PERTURB_=${MALLOC_PERTURB_:-$(( ${RANDOM:-0} % 255 + 1))}  tests/test-block-backend -m=quick -k --tap < /dev/null | ./scripts/tap-driver.pl --test-name="test-block-backend" 
==9742==WARNING: ASan doesn't fully support makecontext/swapcontext functions and may produce false positives in some cases!
PASS 1 test-block-backend /block-backend/drain_aio_error
PASS 2 test-block-backend /block-backend/drain_all_aio_error
PASS 8 ahci-test /x86_64/ahci/reset
MALLOC_PERTURB_=${MALLOC_PERTURB_:-$(( ${RANDOM:-0} % 255 + 1))}  tests/test-block-iothread -m=quick -k --tap < /dev/null | ./scripts/tap-driver.pl --test-name="test-block-iothread" 
==9746==WARNING: ASan doesn't fully support makecontext/swapcontext functions and may produce false positives in some cases!
==9748==WARNING: ASan doesn't fully support makecontext/swapcontext functions and may produce false positives in some cases!
PASS 1 test-block-iothread /sync-op/pread
PASS 2 test-block-iothread /sync-op/pwrite
PASS 3 test-block-iothread /sync-op/load_vmstate
---
PASS 14 test-block-iothread /propagate/basic
PASS 15 test-block-iothread /propagate/diamond
PASS 16 test-block-iothread /propagate/mirror
==9746==WARNING: ASan is ignoring requested __asan_handle_no_return: stack top: 0x7ffc9edf2000; bottom 0x7feb0ebfe000; size: 0x0011901f4000 (75432411136)
False positive error reports may follow
For details see https://github.com/google/sanitizers/issues/189
MALLOC_PERTURB_=${MALLOC_PERTURB_:-$(( ${RANDOM:-0} % 255 + 1))}  tests/test-image-locking -m=quick -k --tap < /dev/null | ./scripts/tap-driver.pl --test-name="test-image-locking" 
==9773==WARNING: ASan doesn't fully support makecontext/swapcontext functions and may produce false positives in some cases!
PASS 1 test-image-locking /image-locking/basic
PASS 2 test-image-locking /image-locking/set-perm-abort
PASS 9 ahci-test /x86_64/ahci/io/pio/lba28/simple/zero
---
PASS 3 test-xbzrle /xbzrle/encode_decode_unchanged
PASS 4 test-xbzrle /xbzrle/encode_decode_1_byte
PASS 5 test-xbzrle /xbzrle/encode_decode_overflow
==9778==WARNING: ASan doesn't fully support makecontext/swapcontext functions and may produce false positives in some cases!
==9778==WARNING: ASan is ignoring requested __asan_handle_no_return: stack top: 0x7ffd90e1b000; bottom 0x7f6e63bfe000; size: 0x008f2d21d000 (614937513984)
False positive error reports may follow
For details see https://github.com/google/sanitizers/issues/189
PASS 6 test-xbzrle /xbzrle/encode_decode
---
PASS 1 test-shift128 /host-utils/test_lshift
PASS 2 test-shift128 /host-utils/test_rshift
MALLOC_PERTURB_=${MALLOC_PERTURB_:-$(( ${RANDOM:-0} % 255 + 1))}  tests/test-mul64 -m=quick -k --tap < /dev/null | ./scripts/tap-driver.pl --test-name="test-mul64" 
==9796==WARNING: ASan doesn't fully support makecontext/swapcontext functions and may produce false positives in some cases!
==9796==WARNING: ASan is ignoring requested __asan_handle_no_return: stack top: 0x7fff8f27c000; bottom 0x7fd93ddfe000; size: 0x00265147e000 (164572422144)
False positive error reports may follow
For details see https://github.com/google/sanitizers/issues/189
PASS 1 test-mul64 /host-utils/mulu64
---
PASS 10 test-int128 /int128/int128_rshift
MALLOC_PERTURB_=${MALLOC_PERTURB_:-$(( ${RANDOM:-0} % 255 + 1))}  tests/rcutorture -m=quick -k --tap < /dev/null | ./scripts/tap-driver.pl --test-name="rcutorture" 
PASS 11 ahci-test /x86_64/ahci/io/pio/lba28/simple/high
==9830==WARNING: ASan doesn't fully support makecontext/swapcontext functions and may produce false positives in some cases!
PASS 1 rcutorture /rcu/torture/1reader
==9830==WARNING: ASan is ignoring requested __asan_handle_no_return: stack top: 0x7ffe71d3a000; bottom 0x7fd353ffe000; size: 0x002b1dd3c000 (185184010240)
False positive error reports may follow
For details see https://github.com/google/sanitizers/issues/189
PASS 12 ahci-test /x86_64/ahci/io/pio/lba28/double/zero
==9852==WARNING: ASan doesn't fully support makecontext/swapcontext functions and may produce false positives in some cases!
PASS 2 rcutorture /rcu/torture/10readers
MALLOC_PERTURB_=${MALLOC_PERTURB_:-$(( ${RANDOM:-0} % 255 + 1))}  tests/test-rcu-list -m=quick -k --tap < /dev/null | ./scripts/tap-driver.pl --test-name="test-rcu-list" 
==9852==WARNING: ASan is ignoring requested __asan_handle_no_return: stack top: 0x7ffd59a15000; bottom 0x7f6dfc5fe000; size: 0x008f5d417000 (615744892928)
False positive error reports may follow
For details see https://github.com/google/sanitizers/issues/189
PASS 13 ahci-test /x86_64/ahci/io/pio/lba28/double/low
==9865==WARNING: ASan doesn't fully support makecontext/swapcontext functions and may produce false positives in some cases!
PASS 1 test-rcu-list /rcu/qlist/single-threaded
==9865==WARNING: ASan is ignoring requested __asan_handle_no_return: stack top: 0x7ffdff9e0000; bottom 0x7f2d889fe000; size: 0x00d076fe2000 (895349563392)
False positive error reports may follow
For details see https://github.com/google/sanitizers/issues/189
PASS 14 ahci-test /x86_64/ahci/io/pio/lba28/double/high
PASS 2 test-rcu-list /rcu/qlist/short-few
==9877==WARNING: ASan doesn't fully support makecontext/swapcontext functions and may produce false positives in some cases!
==9877==WARNING: ASan is ignoring requested __asan_handle_no_return: stack top: 0x7ffc376d7000; bottom 0x7f1e35ffe000; size: 0x00de016d9000 (953506697216)
False positive error reports may follow
For details see https://github.com/google/sanitizers/issues/189
PASS 15 ahci-test /x86_64/ahci/io/pio/lba28/long/zero
PASS 3 test-rcu-list /rcu/qlist/long-many
MALLOC_PERTURB_=${MALLOC_PERTURB_:-$(( ${RANDOM:-0} % 255 + 1))}  tests/test-rcu-simpleq -m=quick -k --tap < /dev/null | ./scripts/tap-driver.pl --test-name="test-rcu-simpleq" 
==9904==WARNING: ASan doesn't fully support makecontext/swapcontext functions and may produce false positives in some cases!
==9904==WARNING: ASan is ignoring requested __asan_handle_no_return: stack top: 0x7ffe22a6e000; bottom 0x7f599c9fe000; size: 0x00a486070000 (706623242240)
False positive error reports may follow
For details see https://github.com/google/sanitizers/issues/189
PASS 1 test-rcu-simpleq /rcu/qsimpleq/single-threaded
PASS 16 ahci-test /x86_64/ahci/io/pio/lba28/long/low
==9923==WARNING: ASan doesn't fully support makecontext/swapcontext functions and may produce false positives in some cases!
==9923==WARNING: ASan is ignoring requested __asan_handle_no_return: stack top: 0x7fff861df000; bottom 0x7f84751fe000; size: 0x007b10fe1000 (528566063104)
False positive error reports may follow
For details see https://github.com/google/sanitizers/issues/189
PASS 2 test-rcu-simpleq /rcu/qsimpleq/short-few
PASS 17 ahci-test /x86_64/ahci/io/pio/lba28/long/high
==9950==WARNING: ASan doesn't fully support makecontext/swapcontext functions and may produce false positives in some cases!
PASS 3 test-rcu-simpleq /rcu/qsimpleq/long-many
MALLOC_PERTURB_=${MALLOC_PERTURB_:-$(( ${RANDOM:-0} % 255 + 1))}  tests/test-rcu-tailq -m=quick -k --tap < /dev/null | ./scripts/tap-driver.pl --test-name="test-rcu-tailq" 
PASS 18 ahci-test /x86_64/ahci/io/pio/lba28/short/zero
==9963==WARNING: ASan doesn't fully support makecontext/swapcontext functions and may produce false positives in some cases!
PASS 1 test-rcu-tailq /rcu/qtailq/single-threaded
PASS 19 ahci-test /x86_64/ahci/io/pio/lba28/short/low
==9975==WARNING: ASan doesn't fully support makecontext/swapcontext functions and may produce false positives in some cases!
PASS 2 test-rcu-tailq /rcu/qtailq/short-few
PASS 20 ahci-test /x86_64/ahci/io/pio/lba28/short/high
==10002==WARNING: ASan doesn't fully support makecontext/swapcontext functions and may produce false positives in some cases!
==10002==WARNING: ASan is ignoring requested __asan_handle_no_return: stack top: 0x7ffed1297000; bottom 0x7f1c061fe000; size: 0x00e2cb099000 (974069010432)
False positive error reports may follow
For details see https://github.com/google/sanitizers/issues/189
PASS 21 ahci-test /x86_64/ahci/io/pio/lba48/simple/zero
==10008==WARNING: ASan doesn't fully support makecontext/swapcontext functions and may produce false positives in some cases!
==10008==WARNING: ASan is ignoring requested __asan_handle_no_return: stack top: 0x7ffc13d38000; bottom 0x7f4d23ffe000; size: 0x00aeefd3a000 (751347933184)
False positive error reports may follow
For details see https://github.com/google/sanitizers/issues/189
PASS 3 test-rcu-tailq /rcu/qtailq/long-many
---
PASS 8 test-qdist /qdist/binning/shrink
MALLOC_PERTURB_=${MALLOC_PERTURB_:-$(( ${RANDOM:-0} % 255 + 1))}  tests/test-qht -m=quick -k --tap < /dev/null | ./scripts/tap-driver.pl --test-name="test-qht" 
PASS 22 ahci-test /x86_64/ahci/io/pio/lba48/simple/low
==10023==WARNING: ASan doesn't fully support makecontext/swapcontext functions and may produce false positives in some cases!
==10023==WARNING: ASan is ignoring requested __asan_handle_no_return: stack top: 0x7fff1296b000; bottom 0x7f9fa0ffe000; size: 0x005f7196d000 (409927602176)
False positive error reports may follow
For details see https://github.com/google/sanitizers/issues/189
PASS 23 ahci-test /x86_64/ahci/io/pio/lba48/simple/high
==10029==WARNING: ASan doesn't fully support makecontext/swapcontext functions and may produce false positives in some cases!
==10029==WARNING: ASan is ignoring requested __asan_handle_no_return: stack top: 0x7ffe7c58c000; bottom 0x7fe8ca3fe000; size: 0x0015b218e000 (93182287872)
False positive error reports may follow
For details see https://github.com/google/sanitizers/issues/189
PASS 24 ahci-test /x86_64/ahci/io/pio/lba48/double/zero
==10035==WARNING: ASan doesn't fully support makecontext/swapcontext functions and may produce false positives in some cases!
==10035==WARNING: ASan is ignoring requested __asan_handle_no_return: stack top: 0x7fff234ed000; bottom 0x7fbfcc9fe000; size: 0x003f56aef000 (272037244928)
False positive error reports may follow
For details see https://github.com/google/sanitizers/issues/189
PASS 25 ahci-test /x86_64/ahci/io/pio/lba48/double/low
==10041==WARNING: ASan doesn't fully support makecontext/swapcontext functions and may produce false positives in some cases!
==10041==WARNING: ASan is ignoring requested __asan_handle_no_return: stack top: 0x7fff1a411000; bottom 0x7f2e83dfe000; size: 0x00d096613000 (895876149248)
False positive error reports may follow
For details see https://github.com/google/sanitizers/issues/189
PASS 26 ahci-test /x86_64/ahci/io/pio/lba48/double/high
==10047==WARNING: ASan doesn't fully support makecontext/swapcontext functions and may produce false positives in some cases!
==10047==WARNING: ASan is ignoring requested __asan_handle_no_return: stack top: 0x7ffdc9e35000; bottom 0x7f85b657c000; size: 0x0078138b9000 (515723988992)
False positive error reports may follow
For details see https://github.com/google/sanitizers/issues/189
PASS 27 ahci-test /x86_64/ahci/io/pio/lba48/long/zero
==10053==WARNING: ASan doesn't fully support makecontext/swapcontext functions and may produce false positives in some cases!
==10053==WARNING: ASan is ignoring requested __asan_handle_no_return: stack top: 0x7fffdc68a000; bottom 0x7f14a2bfe000; size: 0x00eb39a8c000 (1010284675072)
False positive error reports may follow
For details see https://github.com/google/sanitizers/issues/189
PASS 28 ahci-test /x86_64/ahci/io/pio/lba48/long/low
==10059==WARNING: ASan doesn't fully support makecontext/swapcontext functions and may produce false positives in some cases!
==10059==WARNING: ASan is ignoring requested __asan_handle_no_return: stack top: 0x7ffe394ff000; bottom 0x7f172c17c000; size: 0x00e70d383000 (992359231488)
False positive error reports may follow
For details see https://github.com/google/sanitizers/issues/189
PASS 29 ahci-test /x86_64/ahci/io/pio/lba48/long/high
==10065==WARNING: ASan doesn't fully support makecontext/swapcontext functions and may produce false positives in some cases!
PASS 30 ahci-test /x86_64/ahci/io/pio/lba48/short/zero
==10071==WARNING: ASan doesn't fully support makecontext/swapcontext functions and may produce false positives in some cases!
PASS 1 test-qht /qht/mode/default
PASS 31 ahci-test /x86_64/ahci/io/pio/lba48/short/low
PASS 2 test-qht /qht/mode/resize
MALLOC_PERTURB_=${MALLOC_PERTURB_:-$(( ${RANDOM:-0} % 255 + 1))}  tests/test-qht-par -m=quick -k --tap < /dev/null | ./scripts/tap-driver.pl --test-name="test-qht-par" 
==10077==WARNING: ASan doesn't fully support makecontext/swapcontext functions and may produce false positives in some cases!
PASS 1 test-qht-par /qht/parallel/2threads-0%updates-1s
PASS 32 ahci-test /x86_64/ahci/io/pio/lba48/short/high
==10100==WARNING: ASan doesn't fully support makecontext/swapcontext functions and may produce false positives in some cases!
PASS 2 test-qht-par /qht/parallel/2threads-20%updates-1s
MALLOC_PERTURB_=${MALLOC_PERTURB_:-$(( ${RANDOM:-0} % 255 + 1))}  tests/test-bitops -m=quick -k --tap < /dev/null | ./scripts/tap-driver.pl --test-name="test-bitops" 
PASS 1 test-bitops /bitops/sextract32
---
PASS 3 test-qdev-global-props /qdev/properties/dynamic/global
PASS 4 test-qdev-global-props /qdev/properties/global/subclass
MALLOC_PERTURB_=${MALLOC_PERTURB_:-$(( ${RANDOM:-0} % 255 + 1))}  tests/check-qom-interface -m=quick -k --tap < /dev/null | ./scripts/tap-driver.pl --test-name="check-qom-interface" 
==10116==WARNING: ASan doesn't fully support makecontext/swapcontext functions and may produce false positives in some cases!
PASS 1 check-qom-interface /qom/interface/direct_impl
PASS 2 check-qom-interface /qom/interface/intermediate_impl
MALLOC_PERTURB_=${MALLOC_PERTURB_:-$(( ${RANDOM:-0} % 255 + 1))}  tests/check-qom-proplist -m=quick -k --tap < /dev/null | ./scripts/tap-driver.pl --test-name="check-qom-proplist" 
---
PASS 4 test-write-threshold /write-threshold/not-trigger
PASS 5 test-write-threshold /write-threshold/trigger
MALLOC_PERTURB_=${MALLOC_PERTURB_:-$(( ${RANDOM:-0} % 255 + 1))}  tests/test-crypto-hash -m=quick -k --tap < /dev/null | ./scripts/tap-driver.pl --test-name="test-crypto-hash" 
==10152==WARNING: ASan doesn't fully support makecontext/swapcontext functions and may produce false positives in some cases!
PASS 1 test-crypto-hash /crypto/hash/iov
PASS 2 test-crypto-hash /crypto/hash/alloc
PASS 3 test-crypto-hash /crypto/hash/prealloc
---
PASS 15 test-crypto-secret /crypto/secret/crypt/missingiv
PASS 16 test-crypto-secret /crypto/secret/crypt/badiv
MALLOC_PERTURB_=${MALLOC_PERTURB_:-$(( ${RANDOM:-0} % 255 + 1))}  tests/test-crypto-tlscredsx509 -m=quick -k --tap < /dev/null | ./scripts/tap-driver.pl --test-name="test-crypto-tlscredsx509" 
==10178==WARNING: ASan doesn't fully support makecontext/swapcontext functions and may produce false positives in some cases!
PASS 1 test-crypto-tlscredsx509 /qcrypto/tlscredsx509/perfectserver
PASS 36 ahci-test /x86_64/ahci/io/dma/lba28/simple/low
PASS 2 test-crypto-tlscredsx509 /qcrypto/tlscredsx509/perfectclient
==10190==WARNING: ASan doesn't fully support makecontext/swapcontext functions and may produce false positives in some cases!
PASS 3 test-crypto-tlscredsx509 /qcrypto/tlscredsx509/goodca1
PASS 37 ahci-test /x86_64/ahci/io/dma/lba28/simple/high
PASS 4 test-crypto-tlscredsx509 /qcrypto/tlscredsx509/goodca2
---
PASS 6 test-crypto-tlscredsx509 /qcrypto/tlscredsx509/badca1
PASS 7 test-crypto-tlscredsx509 /qcrypto/tlscredsx509/badca2
PASS 8 test-crypto-tlscredsx509 /qcrypto/tlscredsx509/badca3
==10196==WARNING: ASan doesn't fully support makecontext/swapcontext functions and may produce false positives in some cases!
PASS 9 test-crypto-tlscredsx509 /qcrypto/tlscredsx509/goodserver1
PASS 10 test-crypto-tlscredsx509 /qcrypto/tlscredsx509/goodserver2
PASS 38 ahci-test /x86_64/ahci/io/dma/lba28/double/zero
PASS 11 test-crypto-tlscredsx509 /qcrypto/tlscredsx509/goodserver3
PASS 12 test-crypto-tlscredsx509 /qcrypto/tlscredsx509/goodserver4
==10202==WARNING: ASan doesn't fully support makecontext/swapcontext functions and may produce false positives in some cases!
PASS 13 test-crypto-tlscredsx509 /qcrypto/tlscredsx509/goodserver5
PASS 14 test-crypto-tlscredsx509 /qcrypto/tlscredsx509/goodserver6
PASS 39 ahci-test /x86_64/ahci/io/dma/lba28/double/low
==10208==WARNING: ASan doesn't fully support makecontext/swapcontext functions and may produce false positives in some cases!
PASS 15 test-crypto-tlscredsx509 /qcrypto/tlscredsx509/goodserver7
PASS 16 test-crypto-tlscredsx509 /qcrypto/tlscredsx509/badserver1
PASS 17 test-crypto-tlscredsx509 /qcrypto/tlscredsx509/badserver2
---
PASS 39 test-crypto-tlscredsx509 /qcrypto/tlscredsx509/missingclient
MALLOC_PERTURB_=${MALLOC_PERTURB_:-$(( ${RANDOM:-0} % 255 + 1))}  tests/test-crypto-tlssession -m=quick -k --tap < /dev/null | ./scripts/tap-driver.pl --test-name="test-crypto-tlssession" 
PASS 40 ahci-test /x86_64/ahci/io/dma/lba28/double/high
==10218==WARNING: ASan doesn't fully support makecontext/swapcontext functions and may produce false positives in some cases!
PASS 41 ahci-test /x86_64/ahci/io/dma/lba28/long/zero
PASS 1 test-crypto-tlssession /qcrypto/tlssession/psk
==10225==WARNING: ASan doesn't fully support makecontext/swapcontext functions and may produce false positives in some cases!
PASS 42 ahci-test /x86_64/ahci/io/dma/lba28/long/low
PASS 2 test-crypto-tlssession /qcrypto/tlssession/basicca
==10231==WARNING: ASan doesn't fully support makecontext/swapcontext functions and may produce false positives in some cases!
PASS 43 ahci-test /x86_64/ahci/io/dma/lba28/long/high
PASS 3 test-crypto-tlssession /qcrypto/tlssession/differentca
==10237==WARNING: ASan doesn't fully support makecontext/swapcontext functions and may produce false positives in some cases!
PASS 4 test-crypto-tlssession /qcrypto/tlssession/altname1
PASS 44 ahci-test /x86_64/ahci/io/dma/lba28/short/zero
PASS 5 test-crypto-tlssession /qcrypto/tlssession/altname2
==10243==WARNING: ASan doesn't fully support makecontext/swapcontext functions and may produce false positives in some cases!
PASS 6 test-crypto-tlssession /qcrypto/tlssession/altname3
PASS 7 test-crypto-tlssession /qcrypto/tlssession/altname4
PASS 45 ahci-test /x86_64/ahci/io/dma/lba28/short/low
==10249==WARNING: ASan doesn't fully support makecontext/swapcontext functions and may produce false positives in some cases!
PASS 8 test-crypto-tlssession /qcrypto/tlssession/altname5
PASS 46 ahci-test /x86_64/ahci/io/dma/lba28/short/high
==10255==WARNING: ASan doesn't fully support makecontext/swapcontext functions and may produce false positives in some cases!
PASS 9 test-crypto-tlssession /qcrypto/tlssession/altname6
PASS 47 ahci-test /x86_64/ahci/io/dma/lba48/simple/zero
PASS 10 test-crypto-tlssession /qcrypto/tlssession/wildcard1
==10261==WARNING: ASan doesn't fully support makecontext/swapcontext functions and may produce false positives in some cases!
PASS 48 ahci-test /x86_64/ahci/io/dma/lba48/simple/low
==10267==WARNING: ASan doesn't fully support makecontext/swapcontext functions and may produce false positives in some cases!
PASS 49 ahci-test /x86_64/ahci/io/dma/lba48/simple/high
PASS 11 test-crypto-tlssession /qcrypto/tlssession/wildcard2
==10273==WARNING: ASan doesn't fully support makecontext/swapcontext functions and may produce false positives in some cases!
PASS 12 test-crypto-tlssession /qcrypto/tlssession/wildcard3
PASS 50 ahci-test /x86_64/ahci/io/dma/lba48/double/zero
==10279==WARNING: ASan doesn't fully support makecontext/swapcontext functions and may produce false positives in some cases!
PASS 51 ahci-test /x86_64/ahci/io/dma/lba48/double/low
PASS 13 test-crypto-tlssession /qcrypto/tlssession/wildcard4
==10285==WARNING: ASan doesn't fully support makecontext/swapcontext functions and may produce false positives in some cases!
PASS 14 test-crypto-tlssession /qcrypto/tlssession/wildcard5
PASS 15 test-crypto-tlssession /qcrypto/tlssession/wildcard6
PASS 16 test-crypto-tlssession /qcrypto/tlssession/cachain
PASS 52 ahci-test /x86_64/ahci/io/dma/lba48/double/high
MALLOC_PERTURB_=${MALLOC_PERTURB_:-$(( ${RANDOM:-0} % 255 + 1))}  tests/test-qga -m=quick -k --tap < /dev/null | ./scripts/tap-driver.pl --test-name="test-qga" 
==10293==WARNING: ASan doesn't fully support makecontext/swapcontext functions and may produce false positives in some cases!
PASS 53 ahci-test /x86_64/ahci/io/dma/lba48/long/zero
PASS 1 test-qga /qga/sync-delimited
PASS 2 test-qga /qga/sync
---
PASS 15 test-qga /qga/invalid-cmd
PASS 16 test-qga /qga/invalid-args
PASS 17 test-qga /qga/fsfreeze-status
==10304==WARNING: ASan doesn't fully support makecontext/swapcontext functions and may produce false positives in some cases!
PASS 54 ahci-test /x86_64/ahci/io/dma/lba48/long/low
PASS 18 test-qga /qga/blacklist
PASS 19 test-qga /qga/config
PASS 20 test-qga /qga/guest-exec
PASS 21 test-qga /qga/guest-exec-invalid
==10311==WARNING: ASan doesn't fully support makecontext/swapcontext functions and may produce false positives in some cases!
PASS 55 ahci-test /x86_64/ahci/io/dma/lba48/long/high
PASS 22 test-qga /qga/guest-get-osinfo
PASS 23 test-qga /qga/guest-get-host-name
---
MALLOC_PERTURB_=${MALLOC_PERTURB_:-$(( ${RANDOM:-0} % 255 + 1))}  tests/test-timed-average -m=quick -k --tap < /dev/null | ./scripts/tap-driver.pl --test-name="test-timed-average" 
PASS 1 test-timed-average /timed-average/average
MALLOC_PERTURB_=${MALLOC_PERTURB_:-$(( ${RANDOM:-0} % 255 + 1))}  tests/test-util-filemonitor -m=quick -k --tap < /dev/null | ./scripts/tap-driver.pl --test-name="test-util-filemonitor" 
==10324==WARNING: ASan doesn't fully support makecontext/swapcontext functions and may produce false positives in some cases!
PASS 1 test-util-filemonitor /util/filemonitor
MALLOC_PERTURB_=${MALLOC_PERTURB_:-$(( ${RANDOM:-0} % 255 + 1))}  tests/test-util-sockets -m=quick -k --tap < /dev/null | ./scripts/tap-driver.pl --test-name="test-util-sockets" 
PASS 1 test-util-sockets /util/socket/is-socket/bad
---
PASS 4 test-authz-listfile /auth/list/explicit/deny
PASS 5 test-authz-listfile /auth/list/explicit/allow
MALLOC_PERTURB_=${MALLOC_PERTURB_:-$(( ${RANDOM:-0} % 255 + 1))}  tests/test-io-task -m=quick -k --tap < /dev/null | ./scripts/tap-driver.pl --test-name="test-io-task" 
==10353==WARNING: ASan doesn't fully support makecontext/swapcontext functions and may produce false positives in some cases!
PASS 1 test-io-task /crypto/task/complete
PASS 2 test-io-task /crypto/task/datafree
PASS 3 test-io-task /crypto/task/failure
---
PASS 5 test-io-channel-file /io/channel/pipe/async
MALLOC_PERTURB_=${MALLOC_PERTURB_:-$(( ${RANDOM:-0} % 255 + 1))}  tests/test-io-channel-tls -m=quick -k --tap < /dev/null | ./scripts/tap-driver.pl --test-name="test-io-channel-tls" 
PASS 57 ahci-test /x86_64/ahci/io/dma/lba48/short/low
==10429==WARNING: ASan doesn't fully support makecontext/swapcontext functions and may produce false positives in some cases!
PASS 1 test-io-channel-tls /qio/channel/tls/basic
PASS 58 ahci-test /x86_64/ahci/io/dma/lba48/short/high
MALLOC_PERTURB_=${MALLOC_PERTURB_:-$(( ${RANDOM:-0} % 255 + 1))}  tests/test-io-channel-command -m=quick -k --tap < /dev/null | ./scripts/tap-driver.pl --test-name="test-io-channel-command" 
---
PASS 3 test-io-channel-command /io/channel/command/echo/sync
PASS 4 test-io-channel-command /io/channel/command/echo/async
MALLOC_PERTURB_=${MALLOC_PERTURB_:-$(( ${RANDOM:-0} % 255 + 1))}  tests/test-io-channel-buffer -m=quick -k --tap < /dev/null | ./scripts/tap-driver.pl --test-name="test-io-channel-buffer" 
==10441==WARNING: ASan doesn't fully support makecontext/swapcontext functions and may produce false positives in some cases!
PASS 1 test-io-channel-buffer /io/channel/buf
MALLOC_PERTURB_=${MALLOC_PERTURB_:-$(( ${RANDOM:-0} % 255 + 1))}  tests/test-base64 -m=quick -k --tap < /dev/null | ./scripts/tap-driver.pl --test-name="test-base64" 
PASS 1 test-base64 /util/base64/good
---
PASS 8 test-crypto-ivgen /crypto/ivgen/essiv/1f2e3d4c
PASS 9 test-crypto-ivgen /crypto/ivgen/essiv/1f2e3d4c5b6a7988
MALLOC_PERTURB_=${MALLOC_PERTURB_:-$(( ${RANDOM:-0} % 255 + 1))}  tests/test-crypto-afsplit -m=quick -k --tap < /dev/null | ./scripts/tap-driver.pl --test-name="test-crypto-afsplit" 
==10466==WARNING: ASan doesn't fully support makecontext/swapcontext functions and may produce false positives in some cases!
PASS 1 test-crypto-afsplit /crypto/afsplit/sha256/5
PASS 2 test-crypto-afsplit /crypto/afsplit/sha256/5000
PASS 3 test-crypto-afsplit /crypto/afsplit/sha256/big
---
PASS 2 test-logging /logging/parse_path
MALLOC_PERTURB_=${MALLOC_PERTURB_:-$(( ${RANDOM:-0} % 255 + 1))}  tests/test-replication -m=quick -k --tap < /dev/null | ./scripts/tap-driver.pl --test-name="test-replication" 
PASS 60 ahci-test /x86_64/ahci/io/ncq/retry
==10497==WARNING: ASan doesn't fully support makecontext/swapcontext functions and may produce false positives in some cases!
==10499==WARNING: ASan doesn't fully support makecontext/swapcontext functions and may produce false positives in some cases!
PASS 1 test-replication /replication/primary/read
PASS 2 test-replication /replication/primary/write
PASS 61 ahci-test /x86_64/ahci/flush/simple
==10507==WARNING: ASan doesn't fully support makecontext/swapcontext functions and may produce false positives in some cases!
PASS 3 test-replication /replication/primary/start
PASS 4 test-replication /replication/primary/stop
PASS 5 test-replication /replication/primary/do_checkpoint
PASS 6 test-replication /replication/primary/get_error_all
PASS 62 ahci-test /x86_64/ahci/flush/retry
==10513==WARNING: ASan doesn't fully support makecontext/swapcontext functions and may produce false positives in some cases!
PASS 7 test-replication /replication/secondary/read
==10518==WARNING: ASan doesn't fully support makecontext/swapcontext functions and may produce false positives in some cases!
PASS 8 test-replication /replication/secondary/write
PASS 63 ahci-test /x86_64/ahci/flush/migrate
==10527==WARNING: ASan doesn't fully support makecontext/swapcontext functions and may produce false positives in some cases!
==10497==WARNING: ASan is ignoring requested __asan_handle_no_return: stack top: 0x7fff5950a000; bottom 0x7fcb951fc000; size: 0x0033c430e000 (222334869504)
False positive error reports may follow
For details see https://github.com/google/sanitizers/issues/189
==10553==WARNING: ASan doesn't fully support makecontext/swapcontext functions and may produce false positives in some cases!
PASS 9 test-replication /replication/secondary/start
PASS 64 ahci-test /x86_64/ahci/migrate/sanity
==10562==WARNING: ASan doesn't fully support makecontext/swapcontext functions and may produce false positives in some cases!
==10567==WARNING: ASan doesn't fully support makecontext/swapcontext functions and may produce false positives in some cases!
PASS 10 test-replication /replication/secondary/stop
PASS 65 ahci-test /x86_64/ahci/migrate/dma/simple
==10577==WARNING: ASan doesn't fully support makecontext/swapcontext functions and may produce false positives in some cases!
PASS 11 test-replication /replication/secondary/do_checkpoint
==10582==WARNING: ASan doesn't fully support makecontext/swapcontext functions and may produce false positives in some cases!
PASS 12 test-replication /replication/secondary/get_error_all
MALLOC_PERTURB_=${MALLOC_PERTURB_:-$(( ${RANDOM:-0} % 255 + 1))}  tests/test-bufferiszero -m=quick -k --tap < /dev/null | ./scripts/tap-driver.pl --test-name="test-bufferiszero" 
PASS 66 ahci-test /x86_64/ahci/migrate/dma/halted
==10595==WARNING: ASan doesn't fully support makecontext/swapcontext functions and may produce false positives in some cases!
==10600==WARNING: ASan doesn't fully support makecontext/swapcontext functions and may produce false positives in some cases!
PASS 67 ahci-test /x86_64/ahci/migrate/ncq/simple
==10609==WARNING: ASan doesn't fully support makecontext/swapcontext functions and may produce false positives in some cases!
==10614==WARNING: ASan doesn't fully support makecontext/swapcontext functions and may produce false positives in some cases!
PASS 68 ahci-test /x86_64/ahci/migrate/ncq/halted
==10623==WARNING: ASan doesn't fully support makecontext/swapcontext functions and may produce false positives in some cases!
PASS 69 ahci-test /x86_64/ahci/cdrom/eject
==10628==WARNING: ASan doesn't fully support makecontext/swapcontext functions and may produce false positives in some cases!
PASS 70 ahci-test /x86_64/ahci/cdrom/dma/single
==10634==WARNING: ASan doesn't fully support makecontext/swapcontext functions and may produce false positives in some cases!
PASS 71 ahci-test /x86_64/ahci/cdrom/dma/multi
==10640==WARNING: ASan doesn't fully support makecontext/swapcontext functions and may produce false positives in some cases!
PASS 72 ahci-test /x86_64/ahci/cdrom/pio/single
==10646==WARNING: ASan doesn't fully support makecontext/swapcontext functions and may produce false positives in some cases!
==10646==WARNING: ASan is ignoring requested __asan_handle_no_return: stack top: 0x7ffcc824a000; bottom 0x7f48f19ba000; size: 0x00b3d6890000 (772398448640)
False positive error reports may follow
For details see https://github.com/google/sanitizers/issues/189
PASS 73 ahci-test /x86_64/ahci/cdrom/pio/multi
==10652==WARNING: ASan doesn't fully support makecontext/swapcontext functions and may produce false positives in some cases!
PASS 74 ahci-test /x86_64/ahci/cdrom/pio/bcl
MALLOC_PERTURB_=${MALLOC_PERTURB_:-$(( ${RANDOM:-0} % 255 + 1))}  QTEST_QEMU_BINARY=x86_64-softmmu/qemu-system-x86_64 QTEST_QEMU_IMG=qemu-img tests/hd-geo-test -m=quick -k --tap < /dev/null | ./scripts/tap-driver.pl --test-name="hd-geo-test" 
PASS 1 hd-geo-test /x86_64/hd-geo/ide/none
==10666==WARNING: ASan doesn't fully support makecontext/swapcontext functions and may produce false positives in some cases!
PASS 2 hd-geo-test /x86_64/hd-geo/ide/drive/cd_0
==10672==WARNING: ASan doesn't fully support makecontext/swapcontext functions and may produce false positives in some cases!
PASS 3 hd-geo-test /x86_64/hd-geo/ide/drive/mbr/blank
==10678==WARNING: ASan doesn't fully support makecontext/swapcontext functions and may produce false positives in some cases!
PASS 4 hd-geo-test /x86_64/hd-geo/ide/drive/mbr/lba
==10684==WARNING: ASan doesn't fully support makecontext/swapcontext functions and may produce false positives in some cases!
PASS 5 hd-geo-test /x86_64/hd-geo/ide/drive/mbr/chs
==10690==WARNING: ASan doesn't fully support makecontext/swapcontext functions and may produce false positives in some cases!
PASS 6 hd-geo-test /x86_64/hd-geo/ide/device/mbr/blank
==10696==WARNING: ASan doesn't fully support makecontext/swapcontext functions and may produce false positives in some cases!
PASS 7 hd-geo-test /x86_64/hd-geo/ide/device/mbr/lba
==10702==WARNING: ASan doesn't fully support makecontext/swapcontext functions and may produce false positives in some cases!
PASS 8 hd-geo-test /x86_64/hd-geo/ide/device/mbr/chs
==10708==WARNING: ASan doesn't fully support makecontext/swapcontext functions and may produce false positives in some cases!
PASS 9 hd-geo-test /x86_64/hd-geo/ide/device/user/chs
==10713==WARNING: ASan doesn't fully support makecontext/swapcontext functions and may produce false positives in some cases!
PASS 10 hd-geo-test /x86_64/hd-geo/ide/device/user/chst
MALLOC_PERTURB_=${MALLOC_PERTURB_:-$(( ${RANDOM:-0} % 255 + 1))}  QTEST_QEMU_BINARY=x86_64-softmmu/qemu-system-x86_64 QTEST_QEMU_IMG=qemu-img tests/boot-order-test -m=quick -k --tap < /dev/null | ./scripts/tap-driver.pl --test-name="boot-order-test" 
PASS 1 test-bufferiszero /cutils/bufferiszero
---
Could not access KVM kernel module: No such file or directory
qemu-system-x86_64: failed to initialize KVM: No such file or directory
qemu-system-x86_64: Back to tcg accelerator
==10798==WARNING: ASan doesn't fully support makecontext/swapcontext functions and may produce false positives in some cases!
PASS 1 bios-tables-test /x86_64/acpi/piix4
Could not access KVM kernel module: No such file or directory
qemu-system-x86_64: failed to initialize KVM: No such file or directory
qemu-system-x86_64: Back to tcg accelerator
==10804==WARNING: ASan doesn't fully support makecontext/swapcontext functions and may produce false positives in some cases!
PASS 2 bios-tables-test /x86_64/acpi/q35
Could not access KVM kernel module: No such file or directory
qemu-system-x86_64: failed to initialize KVM: No such file or directory
qemu-system-x86_64: Back to tcg accelerator
==10810==WARNING: ASan doesn't fully support makecontext/swapcontext functions and may produce false positives in some cases!
PASS 3 bios-tables-test /x86_64/acpi/piix4/bridge
Could not access KVM kernel module: No such file or directory
qemu-system-x86_64: failed to initialize KVM: No such file or directory
qemu-system-x86_64: Back to tcg accelerator
==10816==WARNING: ASan doesn't fully support makecontext/swapcontext functions and may produce false positives in some cases!
PASS 4 bios-tables-test /x86_64/acpi/piix4/ipmi
Could not access KVM kernel module: No such file or directory
qemu-system-x86_64: failed to initialize KVM: No such file or directory
qemu-system-x86_64: Back to tcg accelerator
==10822==WARNING: ASan doesn't fully support makecontext/swapcontext functions and may produce false positives in some cases!
PASS 5 bios-tables-test /x86_64/acpi/piix4/cpuhp
Could not access KVM kernel module: No such file or directory
qemu-system-x86_64: failed to initialize KVM: No such file or directory
qemu-system-x86_64: Back to tcg accelerator
==10829==WARNING: ASan doesn't fully support makecontext/swapcontext functions and may produce false positives in some cases!
PASS 6 bios-tables-test /x86_64/acpi/piix4/memhp
Could not access KVM kernel module: No such file or directory
qemu-system-x86_64: failed to initialize KVM: No such file or directory
qemu-system-x86_64: Back to tcg accelerator
==10835==WARNING: ASan doesn't fully support makecontext/swapcontext functions and may produce false positives in some cases!
PASS 7 bios-tables-test /x86_64/acpi/piix4/numamem
Could not access KVM kernel module: No such file or directory
qemu-system-x86_64: failed to initialize KVM: No such file or directory
qemu-system-x86_64: Back to tcg accelerator
==10841==WARNING: ASan doesn't fully support makecontext/swapcontext functions and may produce false positives in some cases!
PASS 8 bios-tables-test /x86_64/acpi/piix4/dimmpxm
Could not access KVM kernel module: No such file or directory
qemu-system-x86_64: failed to initialize KVM: No such file or directory
qemu-system-x86_64: Back to tcg accelerator
==10850==WARNING: ASan doesn't fully support makecontext/swapcontext functions and may produce false positives in some cases!
PASS 9 bios-tables-test /x86_64/acpi/q35/bridge
Could not access KVM kernel module: No such file or directory
qemu-system-x86_64: failed to initialize KVM: No such file or directory
qemu-system-x86_64: Back to tcg accelerator
==10856==WARNING: ASan doesn't fully support makecontext/swapcontext functions and may produce false positives in some cases!
PASS 10 bios-tables-test /x86_64/acpi/q35/mmio64
Could not access KVM kernel module: No such file or directory
qemu-system-x86_64: failed to initialize KVM: No such file or directory
qemu-system-x86_64: Back to tcg accelerator
==10862==WARNING: ASan doesn't fully support makecontext/swapcontext functions and may produce false positives in some cases!
PASS 11 bios-tables-test /x86_64/acpi/q35/ipmi
Could not access KVM kernel module: No such file or directory
qemu-system-x86_64: failed to initialize KVM: No such file or directory
qemu-system-x86_64: Back to tcg accelerator
==10868==WARNING: ASan doesn't fully support makecontext/swapcontext functions and may produce false positives in some cases!
PASS 12 bios-tables-test /x86_64/acpi/q35/cpuhp
Could not access KVM kernel module: No such file or directory
qemu-system-x86_64: failed to initialize KVM: No such file or directory
qemu-system-x86_64: Back to tcg accelerator
==10875==WARNING: ASan doesn't fully support makecontext/swapcontext functions and may produce false positives in some cases!
PASS 13 bios-tables-test /x86_64/acpi/q35/memhp
Could not access KVM kernel module: No such file or directory
qemu-system-x86_64: failed to initialize KVM: No such file or directory
qemu-system-x86_64: Back to tcg accelerator
==10881==WARNING: ASan doesn't fully support makecontext/swapcontext functions and may produce false positives in some cases!
PASS 14 bios-tables-test /x86_64/acpi/q35/numamem
Could not access KVM kernel module: No such file or directory
qemu-system-x86_64: failed to initialize KVM: No such file or directory
qemu-system-x86_64: Back to tcg accelerator
==10887==WARNING: ASan doesn't fully support makecontext/swapcontext functions and may produce false positives in some cases!
PASS 15 bios-tables-test /x86_64/acpi/q35/dimmpxm
MALLOC_PERTURB_=${MALLOC_PERTURB_:-$(( ${RANDOM:-0} % 255 + 1))}  QTEST_QEMU_BINARY=x86_64-softmmu/qemu-system-x86_64 QTEST_QEMU_IMG=qemu-img tests/boot-serial-test -m=quick -k --tap < /dev/null | ./scripts/tap-driver.pl --test-name="boot-serial-test" 
PASS 1 boot-serial-test /x86_64/boot-serial/isapc
---
PASS 1 i440fx-test /x86_64/i440fx/defaults
PASS 2 i440fx-test /x86_64/i440fx/pam
PASS 3 i440fx-test /x86_64/i440fx/firmware/bios
==10971==WARNING: ASan doesn't fully support makecontext/swapcontext functions and may produce false positives in some cases!
PASS 4 i440fx-test /x86_64/i440fx/firmware/pflash
MALLOC_PERTURB_=${MALLOC_PERTURB_:-$(( ${RANDOM:-0} % 255 + 1))}  QTEST_QEMU_BINARY=x86_64-softmmu/qemu-system-x86_64 QTEST_QEMU_IMG=qemu-img tests/fw_cfg-test -m=quick -k --tap < /dev/null | ./scripts/tap-driver.pl --test-name="fw_cfg-test" 
PASS 1 fw_cfg-test /x86_64/fw_cfg/signature
---
MALLOC_PERTURB_=${MALLOC_PERTURB_:-$(( ${RANDOM:-0} % 255 + 1))}  QTEST_QEMU_BINARY=x86_64-softmmu/qemu-system-x86_64 QTEST_QEMU_IMG=qemu-img tests/drive_del-test -m=quick -k --tap < /dev/null | ./scripts/tap-driver.pl --test-name="drive_del-test" 
PASS 1 drive_del-test /x86_64/drive_del/without-dev
PASS 2 drive_del-test /x86_64/drive_del/after_failed_device_add
==11059==WARNING: ASan doesn't fully support makecontext/swapcontext functions and may produce false positives in some cases!
PASS 3 drive_del-test /x86_64/blockdev/drive_del_device_del
MALLOC_PERTURB_=${MALLOC_PERTURB_:-$(( ${RANDOM:-0} % 255 + 1))}  QTEST_QEMU_BINARY=x86_64-softmmu/qemu-system-x86_64 QTEST_QEMU_IMG=qemu-img tests/wdt_ib700-test -m=quick -k --tap < /dev/null | ./scripts/tap-driver.pl --test-name="wdt_ib700-test" 
PASS 1 wdt_ib700-test /x86_64/wdt_ib700/pause
---
PASS 1 usb-hcd-uhci-test /x86_64/uhci/pci/init
PASS 2 usb-hcd-uhci-test /x86_64/uhci/pci/port1
PASS 3 usb-hcd-uhci-test /x86_64/uhci/pci/hotplug
==11254==WARNING: ASan doesn't fully support makecontext/swapcontext functions and may produce false positives in some cases!
PASS 4 usb-hcd-uhci-test /x86_64/uhci/pci/hotplug/usb-storage
MALLOC_PERTURB_=${MALLOC_PERTURB_:-$(( ${RANDOM:-0} % 255 + 1))}  QTEST_QEMU_BINARY=x86_64-softmmu/qemu-system-x86_64 QTEST_QEMU_IMG=qemu-img tests/usb-hcd-xhci-test -m=quick -k --tap < /dev/null | ./scripts/tap-driver.pl --test-name="usb-hcd-xhci-test" 
PASS 1 usb-hcd-xhci-test /x86_64/xhci/pci/init
PASS 2 usb-hcd-xhci-test /x86_64/xhci/pci/hotplug
==11263==WARNING: ASan doesn't fully support makecontext/swapcontext functions and may produce false positives in some cases!
PASS 3 usb-hcd-xhci-test /x86_64/xhci/pci/hotplug/usb-uas
PASS 4 usb-hcd-xhci-test /x86_64/xhci/pci/hotplug/usb-ccid
MALLOC_PERTURB_=${MALLOC_PERTURB_:-$(( ${RANDOM:-0} % 255 + 1))}  QTEST_QEMU_BINARY=x86_64-softmmu/qemu-system-x86_64 QTEST_QEMU_IMG=qemu-img tests/cpu-plug-test -m=quick -k --tap < /dev/null | ./scripts/tap-driver.pl --test-name="cpu-plug-test" 
---
Could not access KVM kernel module: No such file or directory
qemu-system-x86_64: failed to initialize KVM: No such file or directory
qemu-system-x86_64: Back to tcg accelerator
==11369==WARNING: ASan doesn't fully support makecontext/swapcontext functions and may produce false positives in some cases!
PASS 1 vmgenid-test /x86_64/vmgenid/vmgenid/set-guid
Could not access KVM kernel module: No such file or directory
qemu-system-x86_64: failed to initialize KVM: No such file or directory
qemu-system-x86_64: Back to tcg accelerator
==11375==WARNING: ASan doesn't fully support makecontext/swapcontext functions and may produce false positives in some cases!
PASS 2 vmgenid-test /x86_64/vmgenid/vmgenid/set-guid-auto
Could not access KVM kernel module: No such file or directory
qemu-system-x86_64: failed to initialize KVM: No such file or directory
qemu-system-x86_64: Back to tcg accelerator
==11381==WARNING: ASan doesn't fully support makecontext/swapcontext functions and may produce false positives in some cases!
PASS 3 vmgenid-test /x86_64/vmgenid/vmgenid/query-monitor
MALLOC_PERTURB_=${MALLOC_PERTURB_:-$(( ${RANDOM:-0} % 255 + 1))}  QTEST_QEMU_BINARY=x86_64-softmmu/qemu-system-x86_64 QTEST_QEMU_IMG=qemu-img tests/tpm-crb-swtpm-test -m=quick -k --tap < /dev/null | ./scripts/tap-driver.pl --test-name="tpm-crb-swtpm-test" 
SKIP 1 tpm-crb-swtpm-test /x86_64/tpm/crb-swtpm/test # SKIP swtpm not in PATH or missing --tpm2 support
---
Could not access KVM kernel module: No such file or directory
qemu-system-x86_64: failed to initialize KVM: No such file or directory
qemu-system-x86_64: Back to tcg accelerator
==11486==WARNING: ASan doesn't fully support makecontext/swapcontext functions and may produce false positives in some cases!
Could not access KVM kernel module: No such file or directory
qemu-system-x86_64: failed to initialize KVM: No such file or directory
qemu-system-x86_64: Back to tcg accelerator
==11491==WARNING: ASan doesn't fully support makecontext/swapcontext functions and may produce false positives in some cases!
PASS 3 migration-test /x86_64/migration/fd_proto
Could not access KVM kernel module: No such file or directory
qemu-system-x86_64: failed to initialize KVM: No such file or directory
qemu-system-x86_64: Back to tcg accelerator
==11499==WARNING: ASan doesn't fully support makecontext/swapcontext functions and may produce false positives in some cases!
Could not access KVM kernel module: No such file or directory
qemu-system-x86_64: failed to initialize KVM: No such file or directory
qemu-system-x86_64: Back to tcg accelerator
==11504==WARNING: ASan doesn't fully support makecontext/swapcontext functions and may produce false positives in some cases!
PASS 4 migration-test /x86_64/migration/postcopy/unix
PASS 5 migration-test /x86_64/migration/postcopy/recovery
Could not access KVM kernel module: No such file or directory
qemu-system-x86_64: failed to initialize KVM: No such file or directory
qemu-system-x86_64: Back to tcg accelerator
==11534==WARNING: ASan doesn't fully support makecontext/swapcontext functions and may produce false positives in some cases!
Could not access KVM kernel module: No such file or directory
qemu-system-x86_64: failed to initialize KVM: No such file or directory
qemu-system-x86_64: Back to tcg accelerator
==11539==WARNING: ASan doesn't fully support makecontext/swapcontext functions and may produce false positives in some cases!
PASS 6 migration-test /x86_64/migration/precopy/unix
Could not access KVM kernel module: No such file or directory
qemu-system-x86_64: failed to initialize KVM: No such file or directory
qemu-system-x86_64: Back to tcg accelerator
==11548==WARNING: ASan doesn't fully support makecontext/swapcontext functions and may produce false positives in some cases!
Could not access KVM kernel module: No such file or directory
qemu-system-x86_64: failed to initialize KVM: No such file or directory
qemu-system-x86_64: Back to tcg accelerator
==11553==WARNING: ASan doesn't fully support makecontext/swapcontext functions and may produce false positives in some cases!
PASS 7 migration-test /x86_64/migration/precopy/tcp
Could not access KVM kernel module: No such file or directory
qemu-system-x86_64: failed to initialize KVM: No such file or directory
qemu-system-x86_64: Back to tcg accelerator
==11562==WARNING: ASan doesn't fully support makecontext/swapcontext functions and may produce false positives in some cases!
Could not access KVM kernel module: No such file or directory
qemu-system-x86_64: failed to initialize KVM: No such file or directory
qemu-system-x86_64: Back to tcg accelerator
==11567==WARNING: ASan doesn't fully support makecontext/swapcontext functions and may produce false positives in some cases!
PASS 8 migration-test /x86_64/migration/xbzrle/unix
MALLOC_PERTURB_=${MALLOC_PERTURB_:-$(( ${RANDOM:-0} % 255 + 1))}  QTEST_QEMU_BINARY=x86_64-softmmu/qemu-system-x86_64 QTEST_QEMU_IMG=qemu-img tests/test-x86-cpuid-compat -m=quick -k --tap < /dev/null | ./scripts/tap-driver.pl --test-name="test-x86-cpuid-compat" 
PASS 1 test-x86-cpuid-compat /x86/cpuid/parsing-plus-minus
---
PASS 6 numa-test /x86_64/numa/pc/dynamic/cpu
MALLOC_PERTURB_=${MALLOC_PERTURB_:-$(( ${RANDOM:-0} % 255 + 1))}  QTEST_QEMU_BINARY=x86_64-softmmu/qemu-system-x86_64 QTEST_QEMU_IMG=qemu-img tests/qmp-test -m=quick -k --tap < /dev/null | ./scripts/tap-driver.pl --test-name="qmp-test" 
PASS 1 qmp-test /x86_64/qmp/protocol
==11896==WARNING: ASan doesn't fully support makecontext/swapcontext functions and may produce false positives in some cases!
PASS 2 qmp-test /x86_64/qmp/oob
PASS 3 qmp-test /x86_64/qmp/preconfig
PASS 4 qmp-test /x86_64/qmp/missing-any-arg
---
PASS 5 device-introspect-test /x86_64/device/introspect/abstract-interfaces

=================================================================
==12144==ERROR: LeakSanitizer: detected memory leaks

Direct leak of 32 byte(s) in 1 object(s) allocated from:
    #0 0x55830952bb6e in calloc (/tmp/qemu-test/build/x86_64-softmmu/qemu-system-x86_64+0x19f7b6e)
---

SUMMARY: AddressSanitizer: 64 byte(s) leaked in 2 allocation(s).
/tmp/qemu-test/src/tests/libqtest.c:137: kill_qemu() tried to terminate QEMU process but encountered exit status 1
ERROR - too few tests run (expected 6, got 5)
make: *** [/tmp/qemu-test/src/tests/Makefile.include:896: check-qtest-x86_64] Error 1
make: *** Waiting for unfinished jobs....
Traceback (most recent call last):


The full log is available at
http://patchew.org/logs/20190703011234.20517-1-richardw.yang@linux.intel.com/testing.asan/?type=message.
---
Email generated automatically by Patchew [https://patchew.org/].
Please send your feedback to patchew-devel@redhat.com
Philippe Mathieu-Daudé July 3, 2019, 9:04 a.m. UTC | #2
On 7/3/19 3:12 AM, Wei Yang wrote:
> Commit 6b6712efccd3 ('ram: Split dirty bitmap by RAMBlock') changes the
> parameter of postcopy_send_discard_bm_ram(), while left the document
> part untouched.
> 
> This patch correct the document and fix one typo by hand.
> 
> Signed-off-by: Wei Yang <richardw.yang@linux.intel.com>
> ---
>  migration/ram.c | 5 ++---
>  1 file changed, 2 insertions(+), 3 deletions(-)
> 
> diff --git a/migration/ram.c b/migration/ram.c
> index 246efe6939..410e0f89fe 100644
> --- a/migration/ram.c
> +++ b/migration/ram.c
> @@ -2763,8 +2763,7 @@ void ram_postcopy_migrated_memory_release(MigrationState *ms)
>   *
>   * @ms: current migration state
>   * @pds: state for postcopy
> - * @start: RAMBlock starting page
> - * @length: RAMBlock size
> + * @block: RAMBlock to discard
>   */
>  static int postcopy_send_discard_bm_ram(MigrationState *ms,
>                                          PostcopyDiscardState *pds,
> @@ -2961,7 +2960,7 @@ static void postcopy_chunk_hostpages_pass(MigrationState *ms, bool unsent_pass,
>  }
>  
>  /**
> - * postcopy_chuck_hostpages: discrad any partially sent host page
> + * postcopy_chuck_hostpages: discard any partially sent host page
>   *
>   * Utility for the outgoing postcopy code.
>   *
> 

Reviewed-by: Philippe Mathieu-Daudé <philmd@redhat.com>
no-reply@patchew.org July 3, 2019, 11:53 a.m. UTC | #3
Patchew URL: https://patchew.org/QEMU/20190703011234.20517-1-richardw.yang@linux.intel.com/



Hi,

This series failed the asan build test. Please find the testing commands and
their output below. If you have Docker installed, you can probably reproduce it
locally.

=== TEST SCRIPT BEGIN ===
#!/bin/bash
make docker-image-fedora V=1 NETWORK=1
time make docker-test-debug@fedora TARGET_LIST=x86_64-softmmu J=14 NETWORK=1
=== TEST SCRIPT END ===

PASS 1 fdc-test /x86_64/fdc/cmos
PASS 2 fdc-test /x86_64/fdc/no_media_on_start
PASS 3 fdc-test /x86_64/fdc/read_without_media
==7805==WARNING: ASan doesn't fully support makecontext/swapcontext functions and may produce false positives in some cases!
PASS 4 fdc-test /x86_64/fdc/media_change
PASS 5 fdc-test /x86_64/fdc/sense_interrupt
PASS 6 fdc-test /x86_64/fdc/relative_seek
---
PASS 32 test-opts-visitor /visitor/opts/range/beyond
PASS 33 test-opts-visitor /visitor/opts/dict/unvisited
MALLOC_PERTURB_=${MALLOC_PERTURB_:-$(( ${RANDOM:-0} % 255 + 1))}  tests/test-coroutine -m=quick -k --tap < /dev/null | ./scripts/tap-driver.pl --test-name="test-coroutine" 
==7850==WARNING: ASan doesn't fully support makecontext/swapcontext functions and may produce false positives in some cases!
==7850==WARNING: ASan is ignoring requested __asan_handle_no_return: stack top: 0x7ffdc5678000; bottom 0x7f4636ff8000; size: 0x00b78e680000 (788368195584)
False positive error reports may follow
For details see https://github.com/google/sanitizers/issues/189
PASS 1 test-coroutine /basic/no-dangling-access
---
PASS 11 test-aio /aio/event/wait
PASS 12 test-aio /aio/event/flush
PASS 13 test-aio /aio/event/wait/no-flush-cb
==7865==WARNING: ASan doesn't fully support makecontext/swapcontext functions and may produce false positives in some cases!
PASS 14 test-aio /aio/timer/schedule
PASS 15 test-aio /aio/coroutine/queue-chaining
PASS 16 test-aio /aio-gsource/flush
---
PASS 28 test-aio /aio-gsource/timer/schedule
MALLOC_PERTURB_=${MALLOC_PERTURB_:-$(( ${RANDOM:-0} % 255 + 1))}  tests/test-aio-multithread -m=quick -k --tap < /dev/null | ./scripts/tap-driver.pl --test-name="test-aio-multithread" 
PASS 1 test-aio-multithread /aio/multi/lifecycle
==7872==WARNING: ASan doesn't fully support makecontext/swapcontext functions and may produce false positives in some cases!
MALLOC_PERTURB_=${MALLOC_PERTURB_:-$(( ${RANDOM:-0} % 255 + 1))}  QTEST_QEMU_BINARY=x86_64-softmmu/qemu-system-x86_64 QTEST_QEMU_IMG=qemu-img tests/ide-test -m=quick -k --tap < /dev/null | ./scripts/tap-driver.pl --test-name="ide-test" 
==7889==WARNING: ASan doesn't fully support makecontext/swapcontext functions and may produce false positives in some cases!
PASS 2 test-aio-multithread /aio/multi/schedule
PASS 1 ide-test /x86_64/ide/identify
PASS 3 test-aio-multithread /aio/multi/mutex/contended
==7900==WARNING: ASan doesn't fully support makecontext/swapcontext functions and may produce false positives in some cases!
PASS 2 ide-test /x86_64/ide/flush
==7911==WARNING: ASan doesn't fully support makecontext/swapcontext functions and may produce false positives in some cases!
PASS 3 ide-test /x86_64/ide/bmdma/simple_rw
==7917==WARNING: ASan doesn't fully support makecontext/swapcontext functions and may produce false positives in some cases!
PASS 4 test-aio-multithread /aio/multi/mutex/handoff
PASS 4 ide-test /x86_64/ide/bmdma/trim
==7928==WARNING: ASan doesn't fully support makecontext/swapcontext functions and may produce false positives in some cases!
PASS 5 test-aio-multithread /aio/multi/mutex/mcs
PASS 5 ide-test /x86_64/ide/bmdma/short_prdt
==7939==WARNING: ASan doesn't fully support makecontext/swapcontext functions and may produce false positives in some cases!
PASS 6 test-aio-multithread /aio/multi/mutex/pthread
MALLOC_PERTURB_=${MALLOC_PERTURB_:-$(( ${RANDOM:-0} % 255 + 1))}  tests/test-throttle -m=quick -k --tap < /dev/null | ./scripts/tap-driver.pl --test-name="test-throttle" 
PASS 6 ide-test /x86_64/ide/bmdma/one_sector_short_prdt
==7947==WARNING: ASan doesn't fully support makecontext/swapcontext functions and may produce false positives in some cases!
PASS 1 test-throttle /throttle/leak_bucket
PASS 2 test-throttle /throttle/compute_wait
PASS 3 test-throttle /throttle/init
---
PASS 13 test-throttle /throttle/config/ranges
PASS 14 test-throttle /throttle/config/max
PASS 15 test-throttle /throttle/config/iops_size
==7949==WARNING: ASan doesn't fully support makecontext/swapcontext functions and may produce false positives in some cases!
MALLOC_PERTURB_=${MALLOC_PERTURB_:-$(( ${RANDOM:-0} % 255 + 1))}  tests/test-thread-pool -m=quick -k --tap < /dev/null | ./scripts/tap-driver.pl --test-name="test-thread-pool" 
==7957==WARNING: ASan doesn't fully support makecontext/swapcontext functions and may produce false positives in some cases!
PASS 1 test-thread-pool /thread-pool/submit
PASS 2 test-thread-pool /thread-pool/submit-aio
PASS 3 test-thread-pool /thread-pool/submit-co
PASS 4 test-thread-pool /thread-pool/submit-many
PASS 7 ide-test /x86_64/ide/bmdma/long_prdt
==8025==WARNING: ASan doesn't fully support makecontext/swapcontext functions and may produce false positives in some cases!
==8025==WARNING: ASan is ignoring requested __asan_handle_no_return: stack top: 0x7ffe3a848000; bottom 0x7f2ff41ba000; size: 0x00ce4668e000 (885944541184)
False positive error reports may follow
For details see https://github.com/google/sanitizers/issues/189
PASS 8 ide-test /x86_64/ide/bmdma/no_busmaster
PASS 5 test-thread-pool /thread-pool/cancel
PASS 9 ide-test /x86_64/ide/flush/nodev
==8036==WARNING: ASan doesn't fully support makecontext/swapcontext functions and may produce false positives in some cases!
PASS 6 test-thread-pool /thread-pool/cancel-async
PASS 10 ide-test /x86_64/ide/flush/empty_drive
MALLOC_PERTURB_=${MALLOC_PERTURB_:-$(( ${RANDOM:-0} % 255 + 1))}  tests/test-hbitmap -m=quick -k --tap < /dev/null | ./scripts/tap-driver.pl --test-name="test-hbitmap" 
---
PASS 2 test-hbitmap /hbitmap/size/0
PASS 3 test-hbitmap /hbitmap/size/unaligned
PASS 4 test-hbitmap /hbitmap/iter/empty
==8042==WARNING: ASan doesn't fully support makecontext/swapcontext functions and may produce false positives in some cases!
PASS 11 ide-test /x86_64/ide/flush/retry_pci
PASS 5 test-hbitmap /hbitmap/iter/partial
==8053==WARNING: ASan doesn't fully support makecontext/swapcontext functions and may produce false positives in some cases!
PASS 6 test-hbitmap /hbitmap/iter/granularity
PASS 7 test-hbitmap /hbitmap/iter/iter_and_reset
PASS 8 test-hbitmap /hbitmap/get/all
---
PASS 15 test-hbitmap /hbitmap/set/overlap
PASS 16 test-hbitmap /hbitmap/reset/empty
PASS 17 test-hbitmap /hbitmap/reset/general
==8059==WARNING: ASan doesn't fully support makecontext/swapcontext functions and may produce false positives in some cases!
PASS 18 test-hbitmap /hbitmap/reset/all
PASS 19 test-hbitmap /hbitmap/truncate/nop
PASS 20 test-hbitmap /hbitmap/truncate/grow/negligible
---
PASS 29 test-hbitmap /hbitmap/truncate/shrink/large
PASS 30 test-hbitmap /hbitmap/meta/zero
PASS 13 ide-test /x86_64/ide/cdrom/pio
==8065==WARNING: ASan doesn't fully support makecontext/swapcontext functions and may produce false positives in some cases!
PASS 14 ide-test /x86_64/ide/cdrom/pio_large
==8071==WARNING: ASan doesn't fully support makecontext/swapcontext functions and may produce false positives in some cases!
PASS 15 ide-test /x86_64/ide/cdrom/dma
MALLOC_PERTURB_=${MALLOC_PERTURB_:-$(( ${RANDOM:-0} % 255 + 1))}  QTEST_QEMU_BINARY=x86_64-softmmu/qemu-system-x86_64 QTEST_QEMU_IMG=qemu-img tests/ahci-test -m=quick -k --tap < /dev/null | ./scripts/tap-driver.pl --test-name="ahci-test" 
PASS 31 test-hbitmap /hbitmap/meta/one
PASS 32 test-hbitmap /hbitmap/meta/byte
PASS 33 test-hbitmap /hbitmap/meta/word
==8085==WARNING: ASan doesn't fully support makecontext/swapcontext functions and may produce false positives in some cases!
PASS 34 test-hbitmap /hbitmap/meta/sector
PASS 35 test-hbitmap /hbitmap/serialize/align
PASS 1 ahci-test /x86_64/ahci/sanity
==8091==WARNING: ASan doesn't fully support makecontext/swapcontext functions and may produce false positives in some cases!
PASS 2 ahci-test /x86_64/ahci/pci_spec
PASS 36 test-hbitmap /hbitmap/serialize/basic
PASS 37 test-hbitmap /hbitmap/serialize/part
---
PASS 42 test-hbitmap /hbitmap/next_dirty_area/next_dirty_area_1
PASS 43 test-hbitmap /hbitmap/next_dirty_area/next_dirty_area_4
MALLOC_PERTURB_=${MALLOC_PERTURB_:-$(( ${RANDOM:-0} % 255 + 1))}  tests/test-bdrv-drain -m=quick -k --tap < /dev/null | ./scripts/tap-driver.pl --test-name="test-bdrv-drain" 
==8097==WARNING: ASan doesn't fully support makecontext/swapcontext functions and may produce false positives in some cases!
==8100==WARNING: ASan doesn't fully support makecontext/swapcontext functions and may produce false positives in some cases!
PASS 1 test-bdrv-drain /bdrv-drain/nested
PASS 2 test-bdrv-drain /bdrv-drain/multiparent
PASS 3 test-bdrv-drain /bdrv-drain/set_aio_context
---
PASS 37 test-bdrv-drain /bdrv-drain/detach/parent_cb
PASS 38 test-bdrv-drain /bdrv-drain/detach/driver_cb
PASS 39 test-bdrv-drain /bdrv-drain/attach/drain
==8135==WARNING: ASan doesn't fully support makecontext/swapcontext functions and may produce false positives in some cases!
MALLOC_PERTURB_=${MALLOC_PERTURB_:-$(( ${RANDOM:-0} % 255 + 1))}  tests/test-bdrv-graph-mod -m=quick -k --tap < /dev/null | ./scripts/tap-driver.pl --test-name="test-bdrv-graph-mod" 
==8150==WARNING: ASan doesn't fully support makecontext/swapcontext functions and may produce false positives in some cases!
PASS 1 test-bdrv-graph-mod /bdrv-graph-mod/update-perm-tree
PASS 2 test-bdrv-graph-mod /bdrv-graph-mod/should-update-child
MALLOC_PERTURB_=${MALLOC_PERTURB_:-$(( ${RANDOM:-0} % 255 + 1))}  tests/test-blockjob -m=quick -k --tap < /dev/null | ./scripts/tap-driver.pl --test-name="test-blockjob" 
PASS 4 ahci-test /x86_64/ahci/hba_spec
==8156==WARNING: ASan doesn't fully support makecontext/swapcontext functions and may produce false positives in some cases!
PASS 1 test-blockjob /blockjob/ids
PASS 2 test-blockjob /blockjob/cancel/created
PASS 3 test-blockjob /blockjob/cancel/running
---
PASS 7 test-blockjob /blockjob/cancel/pending
PASS 8 test-blockjob /blockjob/cancel/concluded
MALLOC_PERTURB_=${MALLOC_PERTURB_:-$(( ${RANDOM:-0} % 255 + 1))}  tests/test-blockjob-txn -m=quick -k --tap < /dev/null | ./scripts/tap-driver.pl --test-name="test-blockjob-txn" 
==8158==WARNING: ASan doesn't fully support makecontext/swapcontext functions and may produce false positives in some cases!
==8162==WARNING: ASan doesn't fully support makecontext/swapcontext functions and may produce false positives in some cases!
PASS 1 test-blockjob-txn /single/success
PASS 2 test-blockjob-txn /single/failure
PASS 3 test-blockjob-txn /single/cancel
---
PASS 7 test-blockjob-txn /pair/fail-cancel-race
MALLOC_PERTURB_=${MALLOC_PERTURB_:-$(( ${RANDOM:-0} % 255 + 1))}  tests/test-block-backend -m=quick -k --tap < /dev/null | ./scripts/tap-driver.pl --test-name="test-block-backend" 
PASS 5 ahci-test /x86_64/ahci/hba_enable
==8172==WARNING: ASan doesn't fully support makecontext/swapcontext functions and may produce false positives in some cases!
PASS 1 test-block-backend /block-backend/drain_aio_error
PASS 2 test-block-backend /block-backend/drain_all_aio_error
MALLOC_PERTURB_=${MALLOC_PERTURB_:-$(( ${RANDOM:-0} % 255 + 1))}  tests/test-block-iothread -m=quick -k --tap < /dev/null | ./scripts/tap-driver.pl --test-name="test-block-iothread" 
==8174==WARNING: ASan doesn't fully support makecontext/swapcontext functions and may produce false positives in some cases!
==8178==WARNING: ASan doesn't fully support makecontext/swapcontext functions and may produce false positives in some cases!
PASS 1 test-block-iothread /sync-op/pread
PASS 2 test-block-iothread /sync-op/pwrite
PASS 3 test-block-iothread /sync-op/load_vmstate
---
PASS 15 test-block-iothread /propagate/diamond
PASS 16 test-block-iothread /propagate/mirror
MALLOC_PERTURB_=${MALLOC_PERTURB_:-$(( ${RANDOM:-0} % 255 + 1))}  tests/test-image-locking -m=quick -k --tap < /dev/null | ./scripts/tap-driver.pl --test-name="test-image-locking" 
==8204==WARNING: ASan doesn't fully support makecontext/swapcontext functions and may produce false positives in some cases!
PASS 1 test-image-locking /image-locking/basic
PASS 2 test-image-locking /image-locking/set-perm-abort
PASS 6 ahci-test /x86_64/ahci/identify
MALLOC_PERTURB_=${MALLOC_PERTURB_:-$(( ${RANDOM:-0} % 255 + 1))}  tests/test-x86-cpuid -m=quick -k --tap < /dev/null | ./scripts/tap-driver.pl --test-name="test-x86-cpuid" 
==8208==WARNING: ASan doesn't fully support makecontext/swapcontext functions and may produce false positives in some cases!
PASS 1 test-x86-cpuid /cpuid/topology/basic
MALLOC_PERTURB_=${MALLOC_PERTURB_:-$(( ${RANDOM:-0} % 255 + 1))}  tests/test-xbzrle -m=quick -k --tap < /dev/null | ./scripts/tap-driver.pl --test-name="test-xbzrle" 
PASS 1 test-xbzrle /xbzrle/uleb
---
PASS 4 test-xbzrle /xbzrle/encode_decode_1_byte
PASS 5 test-xbzrle /xbzrle/encode_decode_overflow
PASS 7 ahci-test /x86_64/ahci/max
==8221==WARNING: ASan doesn't fully support makecontext/swapcontext functions and may produce false positives in some cases!
PASS 6 test-xbzrle /xbzrle/encode_decode
MALLOC_PERTURB_=${MALLOC_PERTURB_:-$(( ${RANDOM:-0} % 255 + 1))}  tests/test-vmstate -m=quick -k --tap < /dev/null | ./scripts/tap-driver.pl --test-name="test-vmstate" 
PASS 1 test-vmstate /vmstate/tmp_struct
---
PASS 1 test-mul64 /host-utils/mulu64
PASS 2 test-mul64 /host-utils/muls64
MALLOC_PERTURB_=${MALLOC_PERTURB_:-$(( ${RANDOM:-0} % 255 + 1))}  tests/test-int128 -m=quick -k --tap < /dev/null | ./scripts/tap-driver.pl --test-name="test-int128" 
==8241==WARNING: ASan doesn't fully support makecontext/swapcontext functions and may produce false positives in some cases!
PASS 1 test-int128 /int128/int128_and
PASS 2 test-int128 /int128/int128_add
PASS 3 test-int128 /int128/int128_sub
---
PASS 9 test-int128 /int128/int128_gt
PASS 10 test-int128 /int128/int128_rshift
MALLOC_PERTURB_=${MALLOC_PERTURB_:-$(( ${RANDOM:-0} % 255 + 1))}  tests/rcutorture -m=quick -k --tap < /dev/null | ./scripts/tap-driver.pl --test-name="rcutorture" 
==8241==WARNING: ASan is ignoring requested __asan_handle_no_return: stack top: 0x7fff569bc000; bottom 0x7f0a8a5fe000; size: 0x00f4cc3be000 (1051398496256)
False positive error reports may follow
For details see https://github.com/google/sanitizers/issues/189
PASS 9 ahci-test /x86_64/ahci/io/pio/lba28/simple/zero
PASS 1 rcutorture /rcu/torture/1reader
==8266==WARNING: ASan doesn't fully support makecontext/swapcontext functions and may produce false positives in some cases!
==8266==WARNING: ASan is ignoring requested __asan_handle_no_return: stack top: 0x7fff96dcf000; bottom 0x7f96221fe000; size: 0x006974bd1000 (452930113536)
False positive error reports may follow
For details see https://github.com/google/sanitizers/issues/189
PASS 2 rcutorture /rcu/torture/10readers
MALLOC_PERTURB_=${MALLOC_PERTURB_:-$(( ${RANDOM:-0} % 255 + 1))}  tests/test-rcu-list -m=quick -k --tap < /dev/null | ./scripts/tap-driver.pl --test-name="test-rcu-list" 
PASS 10 ahci-test /x86_64/ahci/io/pio/lba28/simple/low
==8295==WARNING: ASan doesn't fully support makecontext/swapcontext functions and may produce false positives in some cases!
==8295==WARNING: ASan is ignoring requested __asan_handle_no_return: stack top: 0x7ffd2306e000; bottom 0x7f35253fe000; size: 0x00c7fdc70000 (858956169216)
False positive error reports may follow
For details see https://github.com/google/sanitizers/issues/189
PASS 1 test-rcu-list /rcu/qlist/single-threaded
PASS 11 ahci-test /x86_64/ahci/io/pio/lba28/simple/high
==8307==WARNING: ASan doesn't fully support makecontext/swapcontext functions and may produce false positives in some cases!
PASS 2 test-rcu-list /rcu/qlist/short-few
==8307==WARNING: ASan is ignoring requested __asan_handle_no_return: stack top: 0x7ffed09a7000; bottom 0x7fc87a9fe000; size: 0x003655fa9000 (233370718208)
False positive error reports may follow
For details see https://github.com/google/sanitizers/issues/189
PASS 12 ahci-test /x86_64/ahci/io/pio/lba28/double/zero
==8334==WARNING: ASan doesn't fully support makecontext/swapcontext functions and may produce false positives in some cases!
==8334==WARNING: ASan is ignoring requested __asan_handle_no_return: stack top: 0x7ffc4e75a000; bottom 0x7ffb859fe000; size: 0x0000c8d5c000 (3369451520)
False positive error reports may follow
For details see https://github.com/google/sanitizers/issues/189
PASS 3 test-rcu-list /rcu/qlist/long-many
MALLOC_PERTURB_=${MALLOC_PERTURB_:-$(( ${RANDOM:-0} % 255 + 1))}  tests/test-rcu-simpleq -m=quick -k --tap < /dev/null | ./scripts/tap-driver.pl --test-name="test-rcu-simpleq" 
PASS 13 ahci-test /x86_64/ahci/io/pio/lba28/double/low
==8347==WARNING: ASan doesn't fully support makecontext/swapcontext functions and may produce false positives in some cases!
PASS 1 test-rcu-simpleq /rcu/qsimpleq/single-threaded
==8347==WARNING: ASan is ignoring requested __asan_handle_no_return: stack top: 0x7ffe25873000; bottom 0x7ff892ffe000; size: 0x000592875000 (23933177856)
False positive error reports may follow
For details see https://github.com/google/sanitizers/issues/189
PASS 2 test-rcu-simpleq /rcu/qsimpleq/short-few
PASS 14 ahci-test /x86_64/ahci/io/pio/lba28/double/high
==8380==WARNING: ASan doesn't fully support makecontext/swapcontext functions and may produce false positives in some cases!
==8380==WARNING: ASan is ignoring requested __asan_handle_no_return: stack top: 0x7ffd358f4000; bottom 0x7f07035fe000; size: 0x00f6322f6000 (1057403920384)
False positive error reports may follow
For details see https://github.com/google/sanitizers/issues/189
PASS 15 ahci-test /x86_64/ahci/io/pio/lba28/long/zero
PASS 3 test-rcu-simpleq /rcu/qsimpleq/long-many
MALLOC_PERTURB_=${MALLOC_PERTURB_:-$(( ${RANDOM:-0} % 255 + 1))}  tests/test-rcu-tailq -m=quick -k --tap < /dev/null | ./scripts/tap-driver.pl --test-name="test-rcu-tailq" 
==8386==WARNING: ASan doesn't fully support makecontext/swapcontext functions and may produce false positives in some cases!
==8386==WARNING: ASan is ignoring requested __asan_handle_no_return: stack top: 0x7ffe4f15c000; bottom 0x7fc86c77c000; size: 0x0035e29e0000 (231435272192)
False positive error reports may follow
For details see https://github.com/google/sanitizers/issues/189
PASS 1 test-rcu-tailq /rcu/qtailq/single-threaded
PASS 16 ahci-test /x86_64/ahci/io/pio/lba28/long/low
==8405==WARNING: ASan doesn't fully support makecontext/swapcontext functions and may produce false positives in some cases!
PASS 2 test-rcu-tailq /rcu/qtailq/short-few
==8405==WARNING: ASan is ignoring requested __asan_handle_no_return: stack top: 0x7ffc2c052000; bottom 0x7fa73497c000; size: 0x0054f76d6000 (364928393216)
False positive error reports may follow
For details see https://github.com/google/sanitizers/issues/189
PASS 17 ahci-test /x86_64/ahci/io/pio/lba28/long/high
==8432==WARNING: ASan doesn't fully support makecontext/swapcontext functions and may produce false positives in some cases!
PASS 3 test-rcu-tailq /rcu/qtailq/long-many
MALLOC_PERTURB_=${MALLOC_PERTURB_:-$(( ${RANDOM:-0} % 255 + 1))}  tests/test-qdist -m=quick -k --tap < /dev/null | ./scripts/tap-driver.pl --test-name="test-qdist" 
PASS 1 test-qdist /qdist/none
---
PASS 8 test-qdist /qdist/binning/shrink
MALLOC_PERTURB_=${MALLOC_PERTURB_:-$(( ${RANDOM:-0} % 255 + 1))}  tests/test-qht -m=quick -k --tap < /dev/null | ./scripts/tap-driver.pl --test-name="test-qht" 
PASS 18 ahci-test /x86_64/ahci/io/pio/lba28/short/zero
==8447==WARNING: ASan doesn't fully support makecontext/swapcontext functions and may produce false positives in some cases!
PASS 19 ahci-test /x86_64/ahci/io/pio/lba28/short/low
==8453==WARNING: ASan doesn't fully support makecontext/swapcontext functions and may produce false positives in some cases!
PASS 20 ahci-test /x86_64/ahci/io/pio/lba28/short/high
==8459==WARNING: ASan doesn't fully support makecontext/swapcontext functions and may produce false positives in some cases!
==8459==WARNING: ASan is ignoring requested __asan_handle_no_return: stack top: 0x7ffd578e2000; bottom 0x7f08a35fe000; size: 0x00f4b42e4000 (1050994950144)
False positive error reports may follow
For details see https://github.com/google/sanitizers/issues/189
PASS 21 ahci-test /x86_64/ahci/io/pio/lba48/simple/zero
==8465==WARNING: ASan doesn't fully support makecontext/swapcontext functions and may produce false positives in some cases!
==8465==WARNING: ASan is ignoring requested __asan_handle_no_return: stack top: 0x7ffd9d499000; bottom 0x7f737a1fe000; size: 0x008a2329b000 (593295421440)
False positive error reports may follow
For details see https://github.com/google/sanitizers/issues/189
PASS 22 ahci-test /x86_64/ahci/io/pio/lba48/simple/low
==8471==WARNING: ASan doesn't fully support makecontext/swapcontext functions and may produce false positives in some cases!
==8471==WARNING: ASan is ignoring requested __asan_handle_no_return: stack top: 0x7fffb0e38000; bottom 0x7f0ae41fe000; size: 0x00f4ccc3a000 (1051407392768)
False positive error reports may follow
For details see https://github.com/google/sanitizers/issues/189
PASS 23 ahci-test /x86_64/ahci/io/pio/lba48/simple/high
==8477==WARNING: ASan doesn't fully support makecontext/swapcontext functions and may produce false positives in some cases!
==8477==WARNING: ASan is ignoring requested __asan_handle_no_return: stack top: 0x7ffcfcd4e000; bottom 0x7fc7bf3fe000; size: 0x00353d950000 (228666441728)
False positive error reports may follow
For details see https://github.com/google/sanitizers/issues/189
PASS 24 ahci-test /x86_64/ahci/io/pio/lba48/double/zero
==8483==WARNING: ASan doesn't fully support makecontext/swapcontext functions and may produce false positives in some cases!
==8483==WARNING: ASan is ignoring requested __asan_handle_no_return: stack top: 0x7fffa35dc000; bottom 0x7f1f0d3fe000; size: 0x00e0961de000 (964591214592)
False positive error reports may follow
For details see https://github.com/google/sanitizers/issues/189
PASS 25 ahci-test /x86_64/ahci/io/pio/lba48/double/low
==8489==WARNING: ASan doesn't fully support makecontext/swapcontext functions and may produce false positives in some cases!
==8489==WARNING: ASan is ignoring requested __asan_handle_no_return: stack top: 0x7ffec4b62000; bottom 0x7fd5a8ffe000; size: 0x00291bb64000 (176558587904)
False positive error reports may follow
For details see https://github.com/google/sanitizers/issues/189
PASS 26 ahci-test /x86_64/ahci/io/pio/lba48/double/high
==8495==WARNING: ASan doesn't fully support makecontext/swapcontext functions and may produce false positives in some cases!
==8495==WARNING: ASan is ignoring requested __asan_handle_no_return: stack top: 0x7fffbaec5000; bottom 0x7f3b501fe000; size: 0x00c46acc7000 (843605372928)
False positive error reports may follow
For details see https://github.com/google/sanitizers/issues/189
PASS 27 ahci-test /x86_64/ahci/io/pio/lba48/long/zero
==8501==WARNING: ASan doesn't fully support makecontext/swapcontext functions and may produce false positives in some cases!
==8501==WARNING: ASan is ignoring requested __asan_handle_no_return: stack top: 0x7fffa0b09000; bottom 0x7fad56124000; size: 0x00524a9e5000 (353439207424)
False positive error reports may follow
For details see https://github.com/google/sanitizers/issues/189
PASS 28 ahci-test /x86_64/ahci/io/pio/lba48/long/low
PASS 1 test-qht /qht/mode/default
==8507==WARNING: ASan doesn't fully support makecontext/swapcontext functions and may produce false positives in some cases!
PASS 2 test-qht /qht/mode/resize
MALLOC_PERTURB_=${MALLOC_PERTURB_:-$(( ${RANDOM:-0} % 255 + 1))}  tests/test-qht-par -m=quick -k --tap < /dev/null | ./scripts/tap-driver.pl --test-name="test-qht-par" 
==8507==WARNING: ASan is ignoring requested __asan_handle_no_return: stack top: 0x7ffc7f76e000; bottom 0x7f0ea2dfe000; size: 0x00eddc970000 (1021608132608)
False positive error reports may follow
For details see https://github.com/google/sanitizers/issues/189
PASS 29 ahci-test /x86_64/ahci/io/pio/lba48/long/high
PASS 1 test-qht-par /qht/parallel/2threads-0%updates-1s
==8523==WARNING: ASan doesn't fully support makecontext/swapcontext functions and may produce false positives in some cases!
PASS 2 test-qht-par /qht/parallel/2threads-20%updates-1s
MALLOC_PERTURB_=${MALLOC_PERTURB_:-$(( ${RANDOM:-0} % 255 + 1))}  tests/test-bitops -m=quick -k --tap < /dev/null | ./scripts/tap-driver.pl --test-name="test-bitops" 
PASS 30 ahci-test /x86_64/ahci/io/pio/lba48/short/zero
---
PASS 3 test-bitcnt /bitcnt/ctpop32
PASS 4 test-bitcnt /bitcnt/ctpop64
MALLOC_PERTURB_=${MALLOC_PERTURB_:-$(( ${RANDOM:-0} % 255 + 1))}  tests/test-qdev-global-props -m=quick -k --tap < /dev/null | ./scripts/tap-driver.pl --test-name="test-qdev-global-props" 
==8541==WARNING: ASan doesn't fully support makecontext/swapcontext functions and may produce false positives in some cases!
PASS 1 test-qdev-global-props /qdev/properties/static/default
PASS 2 test-qdev-global-props /qdev/properties/static/global
PASS 3 test-qdev-global-props /qdev/properties/dynamic/global
---
PASS 18 test-qemu-opts /qemu-opts/to_qdict/filtered
PASS 19 test-qemu-opts /qemu-opts/to_qdict/duplicates
MALLOC_PERTURB_=${MALLOC_PERTURB_:-$(( ${RANDOM:-0} % 255 + 1))}  tests/test-keyval -m=quick -k --tap < /dev/null | ./scripts/tap-driver.pl --test-name="test-keyval" 
==8571==WARNING: ASan doesn't fully support makecontext/swapcontext functions and may produce false positives in some cases!
PASS 1 test-keyval /keyval/keyval_parse
PASS 2 test-keyval /keyval/keyval_parse/list
PASS 3 test-keyval /keyval/visit/bool
---
PASS 15 test-crypto-secret /crypto/secret/crypt/missingiv
PASS 16 test-crypto-secret /crypto/secret/crypt/badiv
MALLOC_PERTURB_=${MALLOC_PERTURB_:-$(( ${RANDOM:-0} % 255 + 1))}  tests/test-crypto-tlscredsx509 -m=quick -k --tap < /dev/null | ./scripts/tap-driver.pl --test-name="test-crypto-tlscredsx509" 
==8603==WARNING: ASan doesn't fully support makecontext/swapcontext functions and may produce false positives in some cases!
PASS 1 test-crypto-tlscredsx509 /qcrypto/tlscredsx509/perfectserver
PASS 2 test-crypto-tlscredsx509 /qcrypto/tlscredsx509/perfectclient
PASS 33 ahci-test /x86_64/ahci/io/dma/lba28/fragmented
==8620==WARNING: ASan doesn't fully support makecontext/swapcontext functions and may produce false positives in some cases!
PASS 34 ahci-test /x86_64/ahci/io/dma/lba28/retry
PASS 3 test-crypto-tlscredsx509 /qcrypto/tlscredsx509/goodca1
PASS 4 test-crypto-tlscredsx509 /qcrypto/tlscredsx509/goodca2
==8626==WARNING: ASan doesn't fully support makecontext/swapcontext functions and may produce false positives in some cases!
PASS 5 test-crypto-tlscredsx509 /qcrypto/tlscredsx509/goodca3
PASS 6 test-crypto-tlscredsx509 /qcrypto/tlscredsx509/badca1
PASS 7 test-crypto-tlscredsx509 /qcrypto/tlscredsx509/badca2
PASS 8 test-crypto-tlscredsx509 /qcrypto/tlscredsx509/badca3
PASS 35 ahci-test /x86_64/ahci/io/dma/lba28/simple/zero
PASS 9 test-crypto-tlscredsx509 /qcrypto/tlscredsx509/goodserver1
==8632==WARNING: ASan doesn't fully support makecontext/swapcontext functions and may produce false positives in some cases!
PASS 10 test-crypto-tlscredsx509 /qcrypto/tlscredsx509/goodserver2
PASS 36 ahci-test /x86_64/ahci/io/dma/lba28/simple/low
PASS 11 test-crypto-tlscredsx509 /qcrypto/tlscredsx509/goodserver3
==8638==WARNING: ASan doesn't fully support makecontext/swapcontext functions and may produce false positives in some cases!
PASS 12 test-crypto-tlscredsx509 /qcrypto/tlscredsx509/goodserver4
PASS 13 test-crypto-tlscredsx509 /qcrypto/tlscredsx509/goodserver5
PASS 37 ahci-test /x86_64/ahci/io/dma/lba28/simple/high
PASS 14 test-crypto-tlscredsx509 /qcrypto/tlscredsx509/goodserver6
==8644==WARNING: ASan doesn't fully support makecontext/swapcontext functions and may produce false positives in some cases!
PASS 15 test-crypto-tlscredsx509 /qcrypto/tlscredsx509/goodserver7
PASS 16 test-crypto-tlscredsx509 /qcrypto/tlscredsx509/badserver1
PASS 17 test-crypto-tlscredsx509 /qcrypto/tlscredsx509/badserver2
---
PASS 33 test-crypto-tlscredsx509 /qcrypto/tlscredsx509/inactive2
PASS 34 test-crypto-tlscredsx509 /qcrypto/tlscredsx509/inactive3
PASS 38 ahci-test /x86_64/ahci/io/dma/lba28/double/zero
==8650==WARNING: ASan doesn't fully support makecontext/swapcontext functions and may produce false positives in some cases!
PASS 39 ahci-test /x86_64/ahci/io/dma/lba28/double/low
==8656==WARNING: ASan doesn't fully support makecontext/swapcontext functions and may produce false positives in some cases!
PASS 35 test-crypto-tlscredsx509 /qcrypto/tlscredsx509/chain1
PASS 36 test-crypto-tlscredsx509 /qcrypto/tlscredsx509/chain2
PASS 37 test-crypto-tlscredsx509 /qcrypto/tlscredsx509/missingca
---
MALLOC_PERTURB_=${MALLOC_PERTURB_:-$(( ${RANDOM:-0} % 255 + 1))}  tests/test-crypto-tlssession -m=quick -k --tap < /dev/null | ./scripts/tap-driver.pl --test-name="test-crypto-tlssession" 
PASS 40 ahci-test /x86_64/ahci/io/dma/lba28/double/high
PASS 1 test-crypto-tlssession /qcrypto/tlssession/psk
==8667==WARNING: ASan doesn't fully support makecontext/swapcontext functions and may produce false positives in some cases!
PASS 2 test-crypto-tlssession /qcrypto/tlssession/basicca
PASS 3 test-crypto-tlssession /qcrypto/tlssession/differentca
PASS 41 ahci-test /x86_64/ahci/io/dma/lba28/long/zero
PASS 4 test-crypto-tlssession /qcrypto/tlssession/altname1
==8673==WARNING: ASan doesn't fully support makecontext/swapcontext functions and may produce false positives in some cases!
PASS 5 test-crypto-tlssession /qcrypto/tlssession/altname2
PASS 42 ahci-test /x86_64/ahci/io/dma/lba28/long/low
==8679==WARNING: ASan doesn't fully support makecontext/swapcontext functions and may produce false positives in some cases!
PASS 6 test-crypto-tlssession /qcrypto/tlssession/altname3
PASS 7 test-crypto-tlssession /qcrypto/tlssession/altname4
PASS 43 ahci-test /x86_64/ahci/io/dma/lba28/long/high
PASS 8 test-crypto-tlssession /qcrypto/tlssession/altname5
==8685==WARNING: ASan doesn't fully support makecontext/swapcontext functions and may produce false positives in some cases!
PASS 9 test-crypto-tlssession /qcrypto/tlssession/altname6
PASS 44 ahci-test /x86_64/ahci/io/dma/lba28/short/zero
PASS 10 test-crypto-tlssession /qcrypto/tlssession/wildcard1
PASS 11 test-crypto-tlssession /qcrypto/tlssession/wildcard2
==8691==WARNING: ASan doesn't fully support makecontext/swapcontext functions and may produce false positives in some cases!
PASS 12 test-crypto-tlssession /qcrypto/tlssession/wildcard3
PASS 13 test-crypto-tlssession /qcrypto/tlssession/wildcard4
PASS 45 ahci-test /x86_64/ahci/io/dma/lba28/short/low
PASS 14 test-crypto-tlssession /qcrypto/tlssession/wildcard5
==8697==WARNING: ASan doesn't fully support makecontext/swapcontext functions and may produce false positives in some cases!
PASS 15 test-crypto-tlssession /qcrypto/tlssession/wildcard6
PASS 16 test-crypto-tlssession /qcrypto/tlssession/cachain
PASS 46 ahci-test /x86_64/ahci/io/dma/lba28/short/high
MALLOC_PERTURB_=${MALLOC_PERTURB_:-$(( ${RANDOM:-0} % 255 + 1))}  tests/test-qga -m=quick -k --tap < /dev/null | ./scripts/tap-driver.pl --test-name="test-qga" 
==8704==WARNING: ASan doesn't fully support makecontext/swapcontext functions and may produce false positives in some cases!
PASS 1 test-qga /qga/sync-delimited
PASS 2 test-qga /qga/sync
PASS 3 test-qga /qga/ping
---
PASS 15 test-qga /qga/invalid-cmd
PASS 16 test-qga /qga/invalid-args
PASS 17 test-qga /qga/fsfreeze-status
==8715==WARNING: ASan doesn't fully support makecontext/swapcontext functions and may produce false positives in some cases!
PASS 18 test-qga /qga/blacklist
PASS 19 test-qga /qga/config
PASS 20 test-qga /qga/guest-exec
PASS 21 test-qga /qga/guest-exec-invalid
PASS 48 ahci-test /x86_64/ahci/io/dma/lba48/simple/low
==8729==WARNING: ASan doesn't fully support makecontext/swapcontext functions and may produce false positives in some cases!
PASS 22 test-qga /qga/guest-get-osinfo
PASS 23 test-qga /qga/guest-get-host-name
PASS 24 test-qga /qga/guest-get-timezone
---
MALLOC_PERTURB_=${MALLOC_PERTURB_:-$(( ${RANDOM:-0} % 255 + 1))}  tests/test-util-sockets -m=quick -k --tap < /dev/null | ./scripts/tap-driver.pl --test-name="test-util-sockets" 
PASS 1 test-util-sockets /util/socket/is-socket/bad
PASS 2 test-util-sockets /util/socket/is-socket/good
==8743==WARNING: ASan doesn't fully support makecontext/swapcontext functions and may produce false positives in some cases!
PASS 3 test-util-sockets /socket/fd-pass/name/good
PASS 4 test-util-sockets /socket/fd-pass/name/bad
PASS 5 test-util-sockets /socket/fd-pass/name/nomon
---
PASS 8 test-io-channel-socket /io/channel/socket/unix-fd-pass
PASS 9 test-io-channel-socket /io/channel/socket/unix-listen-cleanup
MALLOC_PERTURB_=${MALLOC_PERTURB_:-$(( ${RANDOM:-0} % 255 + 1))}  tests/test-io-channel-file -m=quick -k --tap < /dev/null | ./scripts/tap-driver.pl --test-name="test-io-channel-file" 
==8774==WARNING: ASan doesn't fully support makecontext/swapcontext functions and may produce false positives in some cases!
PASS 1 test-io-channel-file /io/channel/file
PASS 2 test-io-channel-file /io/channel/file/rdwr
PASS 3 test-io-channel-file /io/channel/file/fd
---
PASS 3 test-base64 /util/base64/not-nul-terminated
PASS 4 test-base64 /util/base64/invalid-chars
MALLOC_PERTURB_=${MALLOC_PERTURB_:-$(( ${RANDOM:-0} % 255 + 1))}  tests/test-crypto-pbkdf -m=quick -k --tap < /dev/null | ./scripts/tap-driver.pl --test-name="test-crypto-pbkdf" 
==8846==WARNING: ASan doesn't fully support makecontext/swapcontext functions and may produce false positives in some cases!
PASS 1 test-crypto-pbkdf /crypto/pbkdf/rfc3962/sha1/iter1
PASS 2 test-crypto-pbkdf /crypto/pbkdf/rfc3962/sha1/iter2
PASS 3 test-crypto-pbkdf /crypto/pbkdf/rfc3962/sha1/iter1200a
---
PASS 1 test-logging /logging/parse_range
PASS 2 test-logging /logging/parse_path
MALLOC_PERTURB_=${MALLOC_PERTURB_:-$(( ${RANDOM:-0} % 255 + 1))}  tests/test-replication -m=quick -k --tap < /dev/null | ./scripts/tap-driver.pl --test-name="test-replication" 
==8898==WARNING: ASan doesn't fully support makecontext/swapcontext functions and may produce false positives in some cases!
==8892==WARNING: ASan doesn't fully support makecontext/swapcontext functions and may produce false positives in some cases!
PASS 1 test-replication /replication/primary/read
PASS 2 test-replication /replication/primary/write
PASS 53 ahci-test /x86_64/ahci/io/dma/lba48/long/zero
---
PASS 4 test-replication /replication/primary/stop
PASS 5 test-replication /replication/primary/do_checkpoint
PASS 6 test-replication /replication/primary/get_error_all
==8907==WARNING: ASan doesn't fully support makecontext/swapcontext functions and may produce false positives in some cases!
PASS 7 test-replication /replication/secondary/read
PASS 54 ahci-test /x86_64/ahci/io/dma/lba48/long/low
==8913==WARNING: ASan doesn't fully support makecontext/swapcontext functions and may produce false positives in some cases!
PASS 8 test-replication /replication/secondary/write
PASS 55 ahci-test /x86_64/ahci/io/dma/lba48/long/high
==8919==WARNING: ASan doesn't fully support makecontext/swapcontext functions and may produce false positives in some cases!
==8898==WARNING: ASan is ignoring requested __asan_handle_no_return: stack top: 0x7ffc582a4000; bottom 0x7fcc09efc000; size: 0x00304e3a8000 (207470886912)
False positive error reports may follow
For details see https://github.com/google/sanitizers/issues/189
PASS 56 ahci-test /x86_64/ahci/io/dma/lba48/short/zero
==8952==WARNING: ASan doesn't fully support makecontext/swapcontext functions and may produce false positives in some cases!
PASS 9 test-replication /replication/secondary/start
PASS 57 ahci-test /x86_64/ahci/io/dma/lba48/short/low
==8958==WARNING: ASan doesn't fully support makecontext/swapcontext functions and may produce false positives in some cases!
PASS 58 ahci-test /x86_64/ahci/io/dma/lba48/short/high
PASS 10 test-replication /replication/secondary/stop
==8964==WARNING: ASan doesn't fully support makecontext/swapcontext functions and may produce false positives in some cases!
PASS 59 ahci-test /x86_64/ahci/io/ncq/simple
==8970==WARNING: ASan doesn't fully support makecontext/swapcontext functions and may produce false positives in some cases!
PASS 11 test-replication /replication/secondary/do_checkpoint
PASS 60 ahci-test /x86_64/ahci/io/ncq/retry
==8976==WARNING: ASan doesn't fully support makecontext/swapcontext functions and may produce false positives in some cases!
PASS 12 test-replication /replication/secondary/get_error_all
MALLOC_PERTURB_=${MALLOC_PERTURB_:-$(( ${RANDOM:-0} % 255 + 1))}  tests/test-bufferiszero -m=quick -k --tap < /dev/null | ./scripts/tap-driver.pl --test-name="test-bufferiszero" 
PASS 61 ahci-test /x86_64/ahci/flush/simple
==8986==WARNING: ASan doesn't fully support makecontext/swapcontext functions and may produce false positives in some cases!
PASS 62 ahci-test /x86_64/ahci/flush/retry
==8992==WARNING: ASan doesn't fully support makecontext/swapcontext functions and may produce false positives in some cases!
==8997==WARNING: ASan doesn't fully support makecontext/swapcontext functions and may produce false positives in some cases!
PASS 63 ahci-test /x86_64/ahci/flush/migrate
==9007==WARNING: ASan doesn't fully support makecontext/swapcontext functions and may produce false positives in some cases!
==9012==WARNING: ASan doesn't fully support makecontext/swapcontext functions and may produce false positives in some cases!
PASS 64 ahci-test /x86_64/ahci/migrate/sanity
==9021==WARNING: ASan doesn't fully support makecontext/swapcontext functions and may produce false positives in some cases!
==9026==WARNING: ASan doesn't fully support makecontext/swapcontext functions and may produce false positives in some cases!
PASS 65 ahci-test /x86_64/ahci/migrate/dma/simple
==9035==WARNING: ASan doesn't fully support makecontext/swapcontext functions and may produce false positives in some cases!
==9040==WARNING: ASan doesn't fully support makecontext/swapcontext functions and may produce false positives in some cases!
PASS 66 ahci-test /x86_64/ahci/migrate/dma/halted
==9049==WARNING: ASan doesn't fully support makecontext/swapcontext functions and may produce false positives in some cases!
==9054==WARNING: ASan doesn't fully support makecontext/swapcontext functions and may produce false positives in some cases!
PASS 67 ahci-test /x86_64/ahci/migrate/ncq/simple
==9063==WARNING: ASan doesn't fully support makecontext/swapcontext functions and may produce false positives in some cases!
==9068==WARNING: ASan doesn't fully support makecontext/swapcontext functions and may produce false positives in some cases!
PASS 68 ahci-test /x86_64/ahci/migrate/ncq/halted
==9077==WARNING: ASan doesn't fully support makecontext/swapcontext functions and may produce false positives in some cases!
PASS 69 ahci-test /x86_64/ahci/cdrom/eject
==9082==WARNING: ASan doesn't fully support makecontext/swapcontext functions and may produce false positives in some cases!
PASS 70 ahci-test /x86_64/ahci/cdrom/dma/single
==9088==WARNING: ASan doesn't fully support makecontext/swapcontext functions and may produce false positives in some cases!
PASS 71 ahci-test /x86_64/ahci/cdrom/dma/multi
==9094==WARNING: ASan doesn't fully support makecontext/swapcontext functions and may produce false positives in some cases!
PASS 72 ahci-test /x86_64/ahci/cdrom/pio/single
PASS 1 test-bufferiszero /cutils/bufferiszero
MALLOC_PERTURB_=${MALLOC_PERTURB_:-$(( ${RANDOM:-0} % 255 + 1))}  tests/test-uuid -m=quick -k --tap < /dev/null | ./scripts/tap-driver.pl --test-name="test-uuid" 
---
PASS 4 test-uuid /uuid/unparse
PASS 5 test-uuid /uuid/unparse_strdup
MALLOC_PERTURB_=${MALLOC_PERTURB_:-$(( ${RANDOM:-0} % 255 + 1))}  tests/ptimer-test -m=quick -k --tap < /dev/null | ./scripts/tap-driver.pl --test-name="ptimer-test" 
==9100==WARNING: ASan doesn't fully support makecontext/swapcontext functions and may produce false positives in some cases!
==9100==WARNING: ASan is ignoring requested __asan_handle_no_return: stack top: 0x7ffeb4258000; bottom 0x7fe192154000; size: 0x001d22104000 (125125541888)
False positive error reports may follow
For details see https://github.com/google/sanitizers/issues/189
PASS 1 ptimer-test /ptimer/set_count policy=default
---
PASS 21 test-qgraph /qgraph/test_two_test_same_interface
PASS 22 test-qgraph /qgraph/test_test_in_path
PASS 23 test-qgraph /qgraph/test_double_edge
==9123==WARNING: ASan doesn't fully support makecontext/swapcontext functions and may produce false positives in some cases!
PASS 74 ahci-test /x86_64/ahci/cdrom/pio/bcl
MALLOC_PERTURB_=${MALLOC_PERTURB_:-$(( ${RANDOM:-0} % 255 + 1))}  QTEST_QEMU_BINARY=x86_64-softmmu/qemu-system-x86_64 QTEST_QEMU_IMG=qemu-img tests/hd-geo-test -m=quick -k --tap < /dev/null | ./scripts/tap-driver.pl --test-name="hd-geo-test" 
PASS 1 hd-geo-test /x86_64/hd-geo/ide/none
==9137==WARNING: ASan doesn't fully support makecontext/swapcontext functions and may produce false positives in some cases!
PASS 2 hd-geo-test /x86_64/hd-geo/ide/drive/cd_0
==9143==WARNING: ASan doesn't fully support makecontext/swapcontext functions and may produce false positives in some cases!
PASS 3 hd-geo-test /x86_64/hd-geo/ide/drive/mbr/blank
==9149==WARNING: ASan doesn't fully support makecontext/swapcontext functions and may produce false positives in some cases!
PASS 4 hd-geo-test /x86_64/hd-geo/ide/drive/mbr/lba
==9155==WARNING: ASan doesn't fully support makecontext/swapcontext functions and may produce false positives in some cases!
PASS 5 hd-geo-test /x86_64/hd-geo/ide/drive/mbr/chs
==9161==WARNING: ASan doesn't fully support makecontext/swapcontext functions and may produce false positives in some cases!
PASS 6 hd-geo-test /x86_64/hd-geo/ide/device/mbr/blank
==9167==WARNING: ASan doesn't fully support makecontext/swapcontext functions and may produce false positives in some cases!
PASS 7 hd-geo-test /x86_64/hd-geo/ide/device/mbr/lba
==9173==WARNING: ASan doesn't fully support makecontext/swapcontext functions and may produce false positives in some cases!
PASS 8 hd-geo-test /x86_64/hd-geo/ide/device/mbr/chs
==9179==WARNING: ASan doesn't fully support makecontext/swapcontext functions and may produce false positives in some cases!
PASS 9 hd-geo-test /x86_64/hd-geo/ide/device/user/chs
==9184==WARNING: ASan doesn't fully support makecontext/swapcontext functions and may produce false positives in some cases!
PASS 10 hd-geo-test /x86_64/hd-geo/ide/device/user/chst
MALLOC_PERTURB_=${MALLOC_PERTURB_:-$(( ${RANDOM:-0} % 255 + 1))}  QTEST_QEMU_BINARY=x86_64-softmmu/qemu-system-x86_64 QTEST_QEMU_IMG=qemu-img tests/boot-order-test -m=quick -k --tap < /dev/null | ./scripts/tap-driver.pl --test-name="boot-order-test" 
PASS 1 boot-order-test /x86_64/boot-order/pc
---
Could not access KVM kernel module: No such file or directory
qemu-system-x86_64: failed to initialize KVM: No such file or directory
qemu-system-x86_64: Back to tcg accelerator
==9252==WARNING: ASan doesn't fully support makecontext/swapcontext functions and may produce false positives in some cases!
PASS 1 bios-tables-test /x86_64/acpi/piix4
Could not access KVM kernel module: No such file or directory
qemu-system-x86_64: failed to initialize KVM: No such file or directory
qemu-system-x86_64: Back to tcg accelerator
==9258==WARNING: ASan doesn't fully support makecontext/swapcontext functions and may produce false positives in some cases!
PASS 2 bios-tables-test /x86_64/acpi/q35
Could not access KVM kernel module: No such file or directory
qemu-system-x86_64: failed to initialize KVM: No such file or directory
qemu-system-x86_64: Back to tcg accelerator
==9264==WARNING: ASan doesn't fully support makecontext/swapcontext functions and may produce false positives in some cases!
PASS 3 bios-tables-test /x86_64/acpi/piix4/bridge
Could not access KVM kernel module: No such file or directory
qemu-system-x86_64: failed to initialize KVM: No such file or directory
qemu-system-x86_64: Back to tcg accelerator
==9270==WARNING: ASan doesn't fully support makecontext/swapcontext functions and may produce false positives in some cases!
PASS 4 bios-tables-test /x86_64/acpi/piix4/ipmi
Could not access KVM kernel module: No such file or directory
qemu-system-x86_64: failed to initialize KVM: No such file or directory
qemu-system-x86_64: Back to tcg accelerator
==9276==WARNING: ASan doesn't fully support makecontext/swapcontext functions and may produce false positives in some cases!
PASS 5 bios-tables-test /x86_64/acpi/piix4/cpuhp
Could not access KVM kernel module: No such file or directory
qemu-system-x86_64: failed to initialize KVM: No such file or directory
qemu-system-x86_64: Back to tcg accelerator
==9283==WARNING: ASan doesn't fully support makecontext/swapcontext functions and may produce false positives in some cases!
PASS 6 bios-tables-test /x86_64/acpi/piix4/memhp
Could not access KVM kernel module: No such file or directory
qemu-system-x86_64: failed to initialize KVM: No such file or directory
qemu-system-x86_64: Back to tcg accelerator
==9289==WARNING: ASan doesn't fully support makecontext/swapcontext functions and may produce false positives in some cases!
PASS 7 bios-tables-test /x86_64/acpi/piix4/numamem
Could not access KVM kernel module: No such file or directory
qemu-system-x86_64: failed to initialize KVM: No such file or directory
qemu-system-x86_64: Back to tcg accelerator
==9295==WARNING: ASan doesn't fully support makecontext/swapcontext functions and may produce false positives in some cases!
PASS 8 bios-tables-test /x86_64/acpi/piix4/dimmpxm
Could not access KVM kernel module: No such file or directory
qemu-system-x86_64: failed to initialize KVM: No such file or directory
qemu-system-x86_64: Back to tcg accelerator
==9304==WARNING: ASan doesn't fully support makecontext/swapcontext functions and may produce false positives in some cases!
PASS 9 bios-tables-test /x86_64/acpi/q35/bridge
Could not access KVM kernel module: No such file or directory
qemu-system-x86_64: failed to initialize KVM: No such file or directory
qemu-system-x86_64: Back to tcg accelerator
==9310==WARNING: ASan doesn't fully support makecontext/swapcontext functions and may produce false positives in some cases!
PASS 10 bios-tables-test /x86_64/acpi/q35/mmio64
Could not access KVM kernel module: No such file or directory
qemu-system-x86_64: failed to initialize KVM: No such file or directory
qemu-system-x86_64: Back to tcg accelerator
==9316==WARNING: ASan doesn't fully support makecontext/swapcontext functions and may produce false positives in some cases!
PASS 11 bios-tables-test /x86_64/acpi/q35/ipmi
Could not access KVM kernel module: No such file or directory
qemu-system-x86_64: failed to initialize KVM: No such file or directory
qemu-system-x86_64: Back to tcg accelerator
==9322==WARNING: ASan doesn't fully support makecontext/swapcontext functions and may produce false positives in some cases!
PASS 12 bios-tables-test /x86_64/acpi/q35/cpuhp
Could not access KVM kernel module: No such file or directory
qemu-system-x86_64: failed to initialize KVM: No such file or directory
qemu-system-x86_64: Back to tcg accelerator
==9329==WARNING: ASan doesn't fully support makecontext/swapcontext functions and may produce false positives in some cases!
PASS 13 bios-tables-test /x86_64/acpi/q35/memhp
Could not access KVM kernel module: No such file or directory
qemu-system-x86_64: failed to initialize KVM: No such file or directory
qemu-system-x86_64: Back to tcg accelerator
==9335==WARNING: ASan doesn't fully support makecontext/swapcontext functions and may produce false positives in some cases!
PASS 14 bios-tables-test /x86_64/acpi/q35/numamem
Could not access KVM kernel module: No such file or directory
qemu-system-x86_64: failed to initialize KVM: No such file or directory
qemu-system-x86_64: Back to tcg accelerator
==9341==WARNING: ASan doesn't fully support makecontext/swapcontext functions and may produce false positives in some cases!
PASS 15 bios-tables-test /x86_64/acpi/q35/dimmpxm
MALLOC_PERTURB_=${MALLOC_PERTURB_:-$(( ${RANDOM:-0} % 255 + 1))}  QTEST_QEMU_BINARY=x86_64-softmmu/qemu-system-x86_64 QTEST_QEMU_IMG=qemu-img tests/boot-serial-test -m=quick -k --tap < /dev/null | ./scripts/tap-driver.pl --test-name="boot-serial-test" 
PASS 1 boot-serial-test /x86_64/boot-serial/isapc
---
PASS 1 i440fx-test /x86_64/i440fx/defaults
PASS 2 i440fx-test /x86_64/i440fx/pam
PASS 3 i440fx-test /x86_64/i440fx/firmware/bios
==9425==WARNING: ASan doesn't fully support makecontext/swapcontext functions and may produce false positives in some cases!
PASS 4 i440fx-test /x86_64/i440fx/firmware/pflash
MALLOC_PERTURB_=${MALLOC_PERTURB_:-$(( ${RANDOM:-0} % 255 + 1))}  QTEST_QEMU_BINARY=x86_64-softmmu/qemu-system-x86_64 QTEST_QEMU_IMG=qemu-img tests/fw_cfg-test -m=quick -k --tap < /dev/null | ./scripts/tap-driver.pl --test-name="fw_cfg-test" 
PASS 1 fw_cfg-test /x86_64/fw_cfg/signature
---
MALLOC_PERTURB_=${MALLOC_PERTURB_:-$(( ${RANDOM:-0} % 255 + 1))}  QTEST_QEMU_BINARY=x86_64-softmmu/qemu-system-x86_64 QTEST_QEMU_IMG=qemu-img tests/drive_del-test -m=quick -k --tap < /dev/null | ./scripts/tap-driver.pl --test-name="drive_del-test" 
PASS 1 drive_del-test /x86_64/drive_del/without-dev
PASS 2 drive_del-test /x86_64/drive_del/after_failed_device_add
==9513==WARNING: ASan doesn't fully support makecontext/swapcontext functions and may produce false positives in some cases!
PASS 3 drive_del-test /x86_64/blockdev/drive_del_device_del
MALLOC_PERTURB_=${MALLOC_PERTURB_:-$(( ${RANDOM:-0} % 255 + 1))}  QTEST_QEMU_BINARY=x86_64-softmmu/qemu-system-x86_64 QTEST_QEMU_IMG=qemu-img tests/wdt_ib700-test -m=quick -k --tap < /dev/null | ./scripts/tap-driver.pl --test-name="wdt_ib700-test" 
PASS 1 wdt_ib700-test /x86_64/wdt_ib700/pause
---
PASS 1 usb-hcd-uhci-test /x86_64/uhci/pci/init
PASS 2 usb-hcd-uhci-test /x86_64/uhci/pci/port1
PASS 3 usb-hcd-uhci-test /x86_64/uhci/pci/hotplug
==9708==WARNING: ASan doesn't fully support makecontext/swapcontext functions and may produce false positives in some cases!
PASS 4 usb-hcd-uhci-test /x86_64/uhci/pci/hotplug/usb-storage
MALLOC_PERTURB_=${MALLOC_PERTURB_:-$(( ${RANDOM:-0} % 255 + 1))}  QTEST_QEMU_BINARY=x86_64-softmmu/qemu-system-x86_64 QTEST_QEMU_IMG=qemu-img tests/usb-hcd-xhci-test -m=quick -k --tap < /dev/null | ./scripts/tap-driver.pl --test-name="usb-hcd-xhci-test" 
PASS 1 usb-hcd-xhci-test /x86_64/xhci/pci/init
PASS 2 usb-hcd-xhci-test /x86_64/xhci/pci/hotplug
==9717==WARNING: ASan doesn't fully support makecontext/swapcontext functions and may produce false positives in some cases!
PASS 3 usb-hcd-xhci-test /x86_64/xhci/pci/hotplug/usb-uas
PASS 4 usb-hcd-xhci-test /x86_64/xhci/pci/hotplug/usb-ccid
MALLOC_PERTURB_=${MALLOC_PERTURB_:-$(( ${RANDOM:-0} % 255 + 1))}  QTEST_QEMU_BINARY=x86_64-softmmu/qemu-system-x86_64 QTEST_QEMU_IMG=qemu-img tests/cpu-plug-test -m=quick -k --tap < /dev/null | ./scripts/tap-driver.pl --test-name="cpu-plug-test" 
---
Could not access KVM kernel module: No such file or directory
qemu-system-x86_64: failed to initialize KVM: No such file or directory
qemu-system-x86_64: Back to tcg accelerator
==9823==WARNING: ASan doesn't fully support makecontext/swapcontext functions and may produce false positives in some cases!
PASS 1 vmgenid-test /x86_64/vmgenid/vmgenid/set-guid
Could not access KVM kernel module: No such file or directory
qemu-system-x86_64: failed to initialize KVM: No such file or directory
qemu-system-x86_64: Back to tcg accelerator
==9829==WARNING: ASan doesn't fully support makecontext/swapcontext functions and may produce false positives in some cases!
PASS 2 vmgenid-test /x86_64/vmgenid/vmgenid/set-guid-auto
Could not access KVM kernel module: No such file or directory
qemu-system-x86_64: failed to initialize KVM: No such file or directory
qemu-system-x86_64: Back to tcg accelerator
==9835==WARNING: ASan doesn't fully support makecontext/swapcontext functions and may produce false positives in some cases!
PASS 3 vmgenid-test /x86_64/vmgenid/vmgenid/query-monitor
MALLOC_PERTURB_=${MALLOC_PERTURB_:-$(( ${RANDOM:-0} % 255 + 1))}  QTEST_QEMU_BINARY=x86_64-softmmu/qemu-system-x86_64 QTEST_QEMU_IMG=qemu-img tests/tpm-crb-swtpm-test -m=quick -k --tap < /dev/null | ./scripts/tap-driver.pl --test-name="tpm-crb-swtpm-test" 
SKIP 1 tpm-crb-swtpm-test /x86_64/tpm/crb-swtpm/test # SKIP swtpm not in PATH or missing --tpm2 support
---
Could not access KVM kernel module: No such file or directory
qemu-system-x86_64: failed to initialize KVM: No such file or directory
qemu-system-x86_64: Back to tcg accelerator
==9940==WARNING: ASan doesn't fully support makecontext/swapcontext functions and may produce false positives in some cases!
Could not access KVM kernel module: No such file or directory
qemu-system-x86_64: failed to initialize KVM: No such file or directory
qemu-system-x86_64: Back to tcg accelerator
==9945==WARNING: ASan doesn't fully support makecontext/swapcontext functions and may produce false positives in some cases!
PASS 3 migration-test /x86_64/migration/fd_proto
Could not access KVM kernel module: No such file or directory
qemu-system-x86_64: failed to initialize KVM: No such file or directory
qemu-system-x86_64: Back to tcg accelerator
==9953==WARNING: ASan doesn't fully support makecontext/swapcontext functions and may produce false positives in some cases!
Could not access KVM kernel module: No such file or directory
qemu-system-x86_64: failed to initialize KVM: No such file or directory
qemu-system-x86_64: Back to tcg accelerator
==9958==WARNING: ASan doesn't fully support makecontext/swapcontext functions and may produce false positives in some cases!
PASS 4 migration-test /x86_64/migration/postcopy/unix
PASS 5 migration-test /x86_64/migration/postcopy/recovery
Could not access KVM kernel module: No such file or directory
qemu-system-x86_64: failed to initialize KVM: No such file or directory
qemu-system-x86_64: Back to tcg accelerator
==9988==WARNING: ASan doesn't fully support makecontext/swapcontext functions and may produce false positives in some cases!
Could not access KVM kernel module: No such file or directory
qemu-system-x86_64: failed to initialize KVM: No such file or directory
qemu-system-x86_64: Back to tcg accelerator
==9993==WARNING: ASan doesn't fully support makecontext/swapcontext functions and may produce false positives in some cases!
PASS 6 migration-test /x86_64/migration/precopy/unix
Could not access KVM kernel module: No such file or directory
qemu-system-x86_64: failed to initialize KVM: No such file or directory
qemu-system-x86_64: Back to tcg accelerator
==10002==WARNING: ASan doesn't fully support makecontext/swapcontext functions and may produce false positives in some cases!
Could not access KVM kernel module: No such file or directory
qemu-system-x86_64: failed to initialize KVM: No such file or directory
qemu-system-x86_64: Back to tcg accelerator
==10007==WARNING: ASan doesn't fully support makecontext/swapcontext functions and may produce false positives in some cases!
PASS 7 migration-test /x86_64/migration/precopy/tcp
Could not access KVM kernel module: No such file or directory
qemu-system-x86_64: failed to initialize KVM: No such file or directory
qemu-system-x86_64: Back to tcg accelerator
==10016==WARNING: ASan doesn't fully support makecontext/swapcontext functions and may produce false positives in some cases!
Could not access KVM kernel module: No such file or directory
qemu-system-x86_64: failed to initialize KVM: No such file or directory
qemu-system-x86_64: Back to tcg accelerator
==10021==WARNING: ASan doesn't fully support makecontext/swapcontext functions and may produce false positives in some cases!
PASS 8 migration-test /x86_64/migration/xbzrle/unix
MALLOC_PERTURB_=${MALLOC_PERTURB_:-$(( ${RANDOM:-0} % 255 + 1))}  QTEST_QEMU_BINARY=x86_64-softmmu/qemu-system-x86_64 QTEST_QEMU_IMG=qemu-img tests/test-x86-cpuid-compat -m=quick -k --tap < /dev/null | ./scripts/tap-driver.pl --test-name="test-x86-cpuid-compat" 
PASS 1 test-x86-cpuid-compat /x86/cpuid/parsing-plus-minus
---
PASS 6 numa-test /x86_64/numa/pc/dynamic/cpu
MALLOC_PERTURB_=${MALLOC_PERTURB_:-$(( ${RANDOM:-0} % 255 + 1))}  QTEST_QEMU_BINARY=x86_64-softmmu/qemu-system-x86_64 QTEST_QEMU_IMG=qemu-img tests/qmp-test -m=quick -k --tap < /dev/null | ./scripts/tap-driver.pl --test-name="qmp-test" 
PASS 1 qmp-test /x86_64/qmp/protocol
==10350==WARNING: ASan doesn't fully support makecontext/swapcontext functions and may produce false positives in some cases!
PASS 2 qmp-test /x86_64/qmp/oob
PASS 3 qmp-test /x86_64/qmp/preconfig
PASS 4 qmp-test /x86_64/qmp/missing-any-arg
---
PASS 5 device-introspect-test /x86_64/device/introspect/abstract-interfaces

=================================================================
==10598==ERROR: LeakSanitizer: detected memory leaks

Direct leak of 32 byte(s) in 1 object(s) allocated from:
    #0 0x55696cb83b6e in calloc (/tmp/qemu-test/build/x86_64-softmmu/qemu-system-x86_64+0x19f7b6e)
---

SUMMARY: AddressSanitizer: 64 byte(s) leaked in 2 allocation(s).
/tmp/qemu-test/src/tests/libqtest.c:137: kill_qemu() tried to terminate QEMU process but encountered exit status 1
ERROR - too few tests run (expected 6, got 5)
make: *** [/tmp/qemu-test/src/tests/Makefile.include:896: check-qtest-x86_64] Error 1
make: *** Waiting for unfinished jobs....
Traceback (most recent call last):


The full log is available at
http://patchew.org/logs/20190703011234.20517-1-richardw.yang@linux.intel.com/testing.asan/?type=message.
---
Email generated automatically by Patchew [https://patchew.org/].
Please send your feedback to patchew-devel@redhat.com
Dr. David Alan Gilbert July 11, 2019, 9:34 a.m. UTC | #4
* Wei Yang (richardw.yang@linux.intel.com) wrote:
> Commit 6b6712efccd3 ('ram: Split dirty bitmap by RAMBlock') changes the
> parameter of postcopy_send_discard_bm_ram(), while left the document
> part untouched.
> 
> This patch correct the document and fix one typo by hand.
> 
> Signed-off-by: Wei Yang <richardw.yang@linux.intel.com>
> ---
>  migration/ram.c | 5 ++---
>  1 file changed, 2 insertions(+), 3 deletions(-)
> 
> diff --git a/migration/ram.c b/migration/ram.c
> index 246efe6939..410e0f89fe 100644
> --- a/migration/ram.c
> +++ b/migration/ram.c
> @@ -2763,8 +2763,7 @@ void ram_postcopy_migrated_memory_release(MigrationState *ms)
>   *
>   * @ms: current migration state
>   * @pds: state for postcopy
> - * @start: RAMBlock starting page
> - * @length: RAMBlock size
> + * @block: RAMBlock to discard
>   */
>  static int postcopy_send_discard_bm_ram(MigrationState *ms,
>                                          PostcopyDiscardState *pds,
> @@ -2961,7 +2960,7 @@ static void postcopy_chunk_hostpages_pass(MigrationState *ms, bool unsent_pass,
>  }
>  
>  /**
> - * postcopy_chuck_hostpages: discrad any partially sent host page
> + * postcopy_chuck_hostpages: discard any partially sent host page

While we're here we should probably fix the name of the function as
well!   s/chuck/chunk/

Dave

>   *
>   * Utility for the outgoing postcopy code.
>   *
> -- 
> 2.19.1
> 
--
Dr. David Alan Gilbert / dgilbert@redhat.com / Manchester, UK
Wei Yang July 12, 2019, 2:29 a.m. UTC | #5
On Thu, Jul 11, 2019 at 10:34:27AM +0100, Dr. David Alan Gilbert wrote:
>* Wei Yang (richardw.yang@linux.intel.com) wrote:
>> Commit 6b6712efccd3 ('ram: Split dirty bitmap by RAMBlock') changes the
>> parameter of postcopy_send_discard_bm_ram(), while left the document
>> part untouched.
>> 
>> This patch correct the document and fix one typo by hand.
>> 
>> Signed-off-by: Wei Yang <richardw.yang@linux.intel.com>
>> ---
>>  migration/ram.c | 5 ++---
>>  1 file changed, 2 insertions(+), 3 deletions(-)
>> 
>> diff --git a/migration/ram.c b/migration/ram.c
>> index 246efe6939..410e0f89fe 100644
>> --- a/migration/ram.c
>> +++ b/migration/ram.c
>> @@ -2763,8 +2763,7 @@ void ram_postcopy_migrated_memory_release(MigrationState *ms)
>>   *
>>   * @ms: current migration state
>>   * @pds: state for postcopy
>> - * @start: RAMBlock starting page
>> - * @length: RAMBlock size
>> + * @block: RAMBlock to discard
>>   */
>>  static int postcopy_send_discard_bm_ram(MigrationState *ms,
>>                                          PostcopyDiscardState *pds,
>> @@ -2961,7 +2960,7 @@ static void postcopy_chunk_hostpages_pass(MigrationState *ms, bool unsent_pass,
>>  }
>>  
>>  /**
>> - * postcopy_chuck_hostpages: discrad any partially sent host page
>> + * postcopy_chuck_hostpages: discard any partially sent host page
>
>While we're here we should probably fix the name of the function as
>well!   s/chuck/chunk/
>

Ah, didn't notice this :)

Do you like me to send v2 to fix this?

>Dave
>
>>   *
>>   * Utility for the outgoing postcopy code.
>>   *
>> -- 
>> 2.19.1
>> 
>--
>Dr. David Alan Gilbert / dgilbert@redhat.com / Manchester, UK

Patch
diff mbox series

diff --git a/migration/ram.c b/migration/ram.c
index 246efe6939..410e0f89fe 100644
--- a/migration/ram.c
+++ b/migration/ram.c
@@ -2763,8 +2763,7 @@  void ram_postcopy_migrated_memory_release(MigrationState *ms)
  *
  * @ms: current migration state
  * @pds: state for postcopy
- * @start: RAMBlock starting page
- * @length: RAMBlock size
+ * @block: RAMBlock to discard
  */
 static int postcopy_send_discard_bm_ram(MigrationState *ms,
                                         PostcopyDiscardState *pds,
@@ -2961,7 +2960,7 @@  static void postcopy_chunk_hostpages_pass(MigrationState *ms, bool unsent_pass,
 }
 
 /**
- * postcopy_chuck_hostpages: discrad any partially sent host page
+ * postcopy_chuck_hostpages: discard any partially sent host page
  *
  * Utility for the outgoing postcopy code.
  *